program: Orca
programVersion: 5.0.2
elementType: O O O C C C C C C C C C C C C C C C C C C C C C C C H H H H H H H H H H H H H H H H H H H H H H H H H H
charge: 0
multiplicity: 1
keywords: wb97x-d3
keywords: def2-TZVPP
keywords: def2/J RIJCOSX
keywords: DEFGRID2
keywords: scfconv7
keywords: smallprint printgap noloewdin
keywords: NOSOSCF
formula: C23H26O3
InChI: InChI=1/C23H26O3/c1-16(2)13-20-21(23(20,3)4)22(24)25-15-17-9-8-12-19(14-17)26-18-10-6-5-7-11-18/h5-14,20-21H,15H2,1-4H3
52 atoms
O  0.424109 -2.38449 -1.114195
O  0.245665 -2.160133 1.102999
O  2.622746 2.103728 -0.220808
C  -2.832689 -2.252078 0.550414
C  -2.411676 -0.820723 0.58382
C  -1.661008 -1.79177 -0.30539
C  -4.069595 -2.623764 -0.232347
C  -2.62262 -3.115852 1.768199
C  -3.267513 0.252171 0.017216
C  -0.262745 -2.127336 0.004978
C  -2.972034 1.098905 -0.972713
C  -3.958814 2.133323 -1.421988
C  -1.675562 1.11775 -1.721591
C  1.806839 -2.703535 -0.997869
C  2.666326 -1.544058 -0.569573
C  2.214834 -0.233491 -0.6209
C  3.964525 -1.803845 -0.137697
C  3.03958 0.796545 -0.187835
C  4.793768 -0.762044 0.244942
C  4.33255 0.547287 0.240697
C  1.383671 2.449428 0.254762
C  0.720648 1.734566 1.246953
C  0.826643 3.607668 -0.271407
C  -0.508414 2.192434 1.702105
C  -0.399111 4.055137 0.199997
C  -1.076117 3.348836 1.184716
H  -1.871642 -0.541658 1.487458
H  -1.877393 -1.730473 -1.365296
H  -4.963949 -2.502015 0.382427
H  -4.024645 -3.668549 -0.545268
H  -4.194106 -2.01299 -1.126624
H  -2.439014 -4.154876 1.487505
H  -3.525921 -3.098362 2.381138
H  -1.799602 -2.784238 2.396285
H  -4.240154 0.353209 0.493128
H  -4.908224 2.06046 -0.89224
H  -4.159713 2.042495 -2.492513
H  -3.557964 3.138891 -1.267742
H  -1.316371 2.143083 -1.829789
H  -1.809264 0.730451 -2.73565
H  -0.890234 0.539522 -1.242909
H  2.096548 -3.037577 -1.995252
H  1.950988 -3.547845 -0.319166
H  1.223972 0.00144 -0.98802
H  4.325695 -2.824063 -0.096448
H  5.802615 -0.970124 0.575506
H  4.967124 1.360674 0.567319
H  1.145488 0.835599 1.67418
H  1.352269 4.156483 -1.042465
H  -1.021999 1.634068 2.474128
H  -0.827677 4.958477 -0.213733
H  -2.035061 3.695277 1.54572
elementType: O C H
totalener: -1117.85482451 hartree
nucrepener: 2395.36726229 hartree
electener: -3513.22208679 hartree
oneelecener: -6280.70468444 hartree
twoeener: 2767.48259764 hartree
cpcmener: -0.02957106 hartree
kineticenergy: 1112.79922432 hartree
xcener: -110.235457014608 hartree
chargesum: 0.0000000
charge: -0.298910 -0.488964 -0.338319 0.126673 -0.018290 -0.023381 -0.279806 -0.286928 -0.299453 0.344316 -0.012773 -0.227496 -0.215510 0.061779 0.014557 -0.250312 -0.215108 0.263869 -0.122412 -0.252051 0.333353 -0.210604 -0.273654 -0.139084 -0.110837 -0.209775 0.093119 0.105750 0.098492 0.099957 0.091146 0.100384 0.095215 0.091618 0.116621 0.089906 0.099884 0.092335 0.104066 0.122267 0.023458 0.130774 0.120784 0.224536 0.144335 0.160759 0.148545 0.150098 0.144126 0.165153 0.157757 0.158035
qa: -0.2989 -0.4890 -0.3383 0.1267 -0.0183 -0.0234 -0.2798 -0.2869 -0.2995 0.3443 -0.0128 -0.2275 -0.2155 0.0618 0.0146 -0.2503 -0.2151 0.2639 -0.1224 -0.2521 0.3334 -0.2106 -0.2737 -0.1391 -0.1108 -0.2098 0.0931 0.1058 0.0985 0.1000 0.0911 0.1004 0.0952 0.0916 0.1166 0.0899 0.0999 0.0923 0.1041 0.1223 0.0235 0.1308 0.1208 0.2245 0.1443 0.1608 0.1485 0.1501 0.1441 0.1652 0.1578 0.1580
va: 2.1132 1.9987 2.0756 3.7864 3.7648 3.7654 3.8994 3.8876 3.8247 4.1422 3.7429 3.9227 3.8859 3.8142 3.6260 3.9244 3.9564 3.7345 3.8777 4.0128 3.6330 3.8367 3.9741 3.8217 3.8361 3.8575 1.0213 1.0259 1.0015 1.0024 1.0050 0.9986 1.0004 1.0206 1.0079 1.0066 0.9974 0.9964 1.0013 1.0031 1.0336 0.9902 1.0080 0.9339 0.9993 0.9876 1.0055 1.0085 1.0102 0.9866 0.9891 0.9920
dispcorr: -0.031484268 hartree
energy: -1117.886308773283
dipole: -25.06009 24.26786 -0.79223 -3.08778 2.65903 -0.42874 -2.54635 1.62717 -0.91919
magnitude: 1.28700 au
magnitude: 3.27128 debye
