program: Orca
programVersion: 5.0.2
elementType: O O O C C C C C C C C C C C C C C C C C C C C C C C H H H H H H H H H H H H H H H H H H H H H H H H H H
charge: 0
multiplicity: 1
keywords: wb97x-d3
keywords: def2-TZVPP
keywords: def2/J RIJCOSX
keywords: DEFGRID2
keywords: scfconv7
keywords: smallprint printgap noloewdin
keywords: NOSOSCF
formula: C23H26O3
InChI: InChI=1/C23H26O3/c1-16(2)13-20-21(23(20,3)4)22(24)25-15-17-9-8-12-19(14-17)26-18-10-6-5-7-11-18/h5-14,20-21H,15H2,1-4H3
52 atoms
O  -0.030868 -1.307423 1.557268
O  -0.259732 -2.386662 -0.386389
O  3.659144 1.871582 -0.088433
C  -2.296282 -0.06889 -0.979315
C  -3.058989 -1.272262 -0.54927
C  -1.902666 -0.784426 0.306676
C  -2.896621 1.301499 -0.77496
C  -1.424576 -0.160732 -2.208398
C  -4.449301 -1.197803 -0.030422
C  -0.671252 -1.578533 0.416203
C  -4.97773 -2.046352 0.855243
C  -6.400872 -1.921964 1.305918
C  -4.212368 -3.176676 1.469883
C  1.218879 -1.957495 1.788736
C  2.324545 -1.383526 0.947677
C  2.434364 -0.006557 0.786971
C  3.274538 -2.222157 0.376372
C  3.489627 0.516669 0.054054
C  4.336691 -1.68395 -0.336008
C  4.44785 -0.312924 -0.509864
C  2.567396 2.650317 -0.38902
C  1.643559 2.26812 -1.353452
C  2.445082 3.865788 0.268415
C  0.589012 3.117604 -1.655116
C  1.388087 4.708266 -0.048279
C  0.453848 4.33741 -1.005294
H  -2.825711 -2.171927 -1.114098
H  -2.175849 -0.259365 1.214535
H  -2.109324 2.055774 -0.715575
H  -3.485752 1.369206 0.139378
H  -3.545233 1.568252 -1.611651
H  -1.964196 0.250091 -3.063656
H  -1.148111 -1.181285 -2.462814
H  -0.507977 0.419004 -2.09081
H  -5.078988 -0.407241 -0.42913
H  -6.457803 -1.79589 2.390035
H  -6.966172 -2.827585 1.072077
H  -6.908118 -1.077505 0.839901
H  -3.188284 -3.252966 1.108411
H  -4.709437 -4.129507 1.271491
H  -4.177603 -3.070139 2.55722
H  1.133691 -3.035186 1.639019
H  1.423059 -1.788405 2.845926
H  1.707655 0.65772 1.239353
H  3.186319 -3.295103 0.492318
H  5.077637 -2.33796 -0.776254
H  5.268549 0.11008 -1.074748
H  1.743828 1.323066 -1.872964
H  3.171617 4.150548 1.01875
H  -0.128524 2.822286 -2.40971
H  1.293362 5.655903 0.465439
H  -0.370793 4.994453 -1.246837
elementType: O C H
totalener: -1117.85531314 hartree
nucrepener: 2295.98516375 hartree
electener: -3413.84047689 hartree
oneelecener: -6081.71181337 hartree
twoeener: 2667.87133648 hartree
cpcmener: -0.03013264 hartree
kineticenergy: 1112.80719225 hartree
xcener: -110.229216668060 hartree
chargesum: 0.0000000
charge: -0.297686 -0.501524 -0.347455 0.179323 -0.038205 -0.090825 -0.297522 -0.286890 -0.295202 0.404900 -0.012952 -0.228042 -0.244926 0.107780 0.022945 -0.207421 -0.221476 0.243893 -0.121849 -0.244282 0.262496 -0.158245 -0.238868 -0.190600 -0.129645 -0.176613 0.104770 0.091925 0.095024 0.095567 0.100753 0.102724 0.097446 0.084175 0.125575 0.095140 0.095889 0.089861 0.081651 0.101551 0.098765 0.116330 0.123366 0.143010 0.146003 0.161525 0.150071 0.162936 0.148369 0.173709 0.160970 0.161786
qa: -0.2977 -0.5015 -0.3475 0.1793 -0.0382 -0.0908 -0.2975 -0.2869 -0.2952 0.4049 -0.0130 -0.2280 -0.2449 0.1078 0.0229 -0.2074 -0.2215 0.2439 -0.1218 -0.2443 0.2625 -0.1582 -0.2389 -0.1906 -0.1296 -0.1766 0.1048 0.0919 0.0950 0.0956 0.1008 0.1027 0.0974 0.0842 0.1256 0.0951 0.0959 0.0899 0.0817 0.1016 0.0988 0.1163 0.1234 0.1430 0.1460 0.1615 0.1501 0.1629 0.1484 0.1737 0.1610 0.1618
va: 2.1053 1.9965 2.0510 3.6411 3.8480 3.7985 3.9217 3.8829 3.8871 4.1232 3.7022 3.9296 3.9391 3.7864 3.6254 3.9108 3.9592 3.7281 3.8912 4.0115 3.7086 3.8538 3.9996 3.8730 3.8895 3.8882 1.0235 1.0338 1.0050 1.0025 0.9991 1.0012 1.0221 1.0048 1.0027 0.9964 0.9961 1.0063 1.0136 0.9990 0.9983 1.0111 0.9926 1.0182 1.0025 0.9878 1.0046 0.9936 1.0065 0.9795 0.9875 0.9900
dispcorr: -0.026845895 hartree
energy: -1117.882159035425
dipole: -29.85214 28.87265 -0.97948 -5.05876 5.43288 0.37412 -0.63208 1.35312 0.72104
magnitude: 1.27250 au
magnitude: 3.23443 debye
