program: Orca
programVersion: 5.0.2
elementType: O O O C C C C C C C C C C C C C C C C C C C C C C C H H H H H H H H H H H H H H H H H H H H H H H H H H
charge: 0
multiplicity: 1
keywords: wb97x-d3
keywords: def2-TZVPP
keywords: def2/J RIJCOSX
keywords: DEFGRID2
keywords: scfconv7
keywords: smallprint printgap noloewdin
keywords: NOSOSCF
formula: C23H26O3
InChI: InChI=1/C23H26O3/c1-16(2)13-20-21(23(20,3)4)22(24)25-15-17-9-8-12-19(14-17)26-18-10-6-5-7-11-18/h5-14,20-21H,15H2,1-4H3
52 atoms
O  0.294913 -2.824972 0.478582
O  -0.266954 -1.860867 -1.456996
O  2.836659 1.438808 1.396465
C  -2.24143 -0.441881 0.631634
C  -2.972048 -1.267287 -0.388469
C  -1.817179 -1.878689 0.369615
C  -2.880758 -0.173209 1.971403
C  -1.375774 0.699769 0.155432
C  -4.331073 -1.798325 -0.157289
C  -0.549683 -2.17012 -0.322405
C  -5.366543 -1.740337 -1.001228
C  -6.684629 -2.35529 -0.635926
C  -5.337236 -1.091755 -2.3516
C  1.611926 -3.068189 -0.016674
C  2.398573 -1.800642 -0.206341
C  2.244665 -0.730308 0.670155
C  3.30004 -1.697367 -1.257759
C  2.987626 0.422192 0.481996
C  4.048868 -0.540166 -1.426554
C  3.89711 0.531417 -0.561701
C  2.45717 2.680348 0.957268
C  1.688642 2.873466 -0.184742
C  2.840802 3.76029 1.742822
C  1.311217 4.162923 -0.535614
C  2.449109 5.040507 1.382375
C  1.687369 5.250597 0.240275
H  -2.738338 -1.003852 -1.414528
H  -2.065335 -2.574295 1.164301
H  -3.443211 -1.023623 2.353304
H  -3.564852 0.67482 1.902465
H  -2.119911 0.076931 2.712697
H  -0.96283 0.542577 -0.839146
H  -0.545421 0.869276 0.844133
H  -1.963831 1.618853 0.121045
H  -4.487631 -2.299897 0.793487
H  -6.9825 -3.107781 -1.3708
H  -7.478741 -1.604225 -0.626596
H  -6.659718 -2.832284 0.343558
H  -4.402984 -0.580579 -2.576719
H  -6.142917 -0.358014 -2.439776
H  -5.510727 -1.830271 -3.140032
H  1.576938 -3.643083 -0.9442
H  2.077471 -3.696588 0.742615
H  1.547164 -0.779175 1.497753
H  3.414192 -2.520534 -1.952108
H  4.751544 -0.468276 -2.246154
H  4.477052 1.435723 -0.696406
H  1.377315 2.037005 -0.797672
H  3.43907 3.595903 2.630119
H  0.713125 4.311692 -1.425083
H  2.750393 5.878828 1.996818
H  1.389071 6.25159 -0.040882
elementType: O C H
totalener: -1117.85673616 hartree
nucrepener: 2260.20272659 hartree
electener: -3378.05946276 hartree
oneelecener: -6010.32277880 hartree
twoeener: 2632.26331605 hartree
cpcmener: -0.03108257 hartree
kineticenergy: 1112.79640336 hartree
xcener: -110.227962335085 hartree
chargesum: 0.0000000
charge: -0.293392 -0.485128 -0.344915 0.131395 0.036804 -0.093000 -0.273849 -0.292673 -0.290512 0.395116 -0.048824 -0.220359 -0.253539 0.097708 0.034702 -0.290224 -0.205405 0.257883 -0.134957 -0.175797 0.313818 -0.208468 -0.249056 -0.175408 -0.132967 -0.184525 0.090204 0.093611 0.090473 0.098720 0.098107 0.097126 0.089798 0.105881 0.121837 0.093202 0.093936 0.088823 0.090574 0.095094 0.098352 0.118886 0.124133 0.140529 0.145967 0.162427 0.159866 0.156628 0.147853 0.161910 0.161043 0.160595
qa: -0.2934 -0.4851 -0.3449 0.1314 0.0368 -0.0930 -0.2738 -0.2927 -0.2905 0.3951 -0.0488 -0.2204 -0.2535 0.0977 0.0347 -0.2902 -0.2054 0.2579 -0.1350 -0.1758 0.3138 -0.2085 -0.2491 -0.1754 -0.1330 -0.1845 0.0902 0.0936 0.0905 0.0987 0.0981 0.0971 0.0898 0.1059 0.1218 0.0932 0.0939 0.0888 0.0906 0.0951 0.0984 0.1189 0.1241 0.1405 0.1460 0.1624 0.1599 0.1566 0.1479 0.1619 0.1610 0.1606
va: 2.1114 2.0122 2.0407 3.6929 3.7961 3.8188 3.9017 3.8947 3.8739 4.1853 3.7552 3.9211 3.9407 3.7871 3.6047 4.0171 3.9639 3.7284 3.8877 3.9389 3.6308 3.8607 3.9984 3.9242 3.8934 3.8947 1.0342 1.0356 1.0054 1.0017 1.0024 1.0135 1.0010 1.0031 1.0095 0.9956 0.9965 1.0087 1.0093 0.9972 0.9958 1.0082 0.9932 1.0217 1.0015 0.9886 0.9945 0.9961 1.0080 0.9904 0.9880 0.9892
dispcorr: -0.025778499 hartree
energy: -1117.882514661793
dipole: -30.00983 29.66596 -0.34387 -1.22842 1.15352 -0.07490 -3.04650 3.33388 0.28737
magnitude: 0.45435 au
magnitude: 1.15488 debye
