program: Orca
programVersion: 5.0.2
elementType: O O O C C C C C C C C C C C C C C C C C C C C C C C H H H H H H H H H H H H H H H H H H H H H H H H H H
charge: 0
multiplicity: 1
keywords: wb97x-d3
keywords: def2-TZVPP
keywords: def2/J RIJCOSX
keywords: DEFGRID2
keywords: scfconv7
keywords: smallprint printgap noloewdin
keywords: NOSOSCF
formula: C23H26O3
InChI: InChI=1/C23H26O3/c1-16(2)13-20-21(23(20,3)4)22(24)25-15-17-9-8-12-19(14-17)26-18-10-6-5-7-11-18/h5-14,20-21H,15H2,1-4H3
52 atoms
O  -0.08518 -1.20016 1.595458
O  -0.271143 -2.394581 -0.284195
O  3.723014 1.853252 -0.177449
C  -2.352454 -0.13423 -0.997181
C  -3.060115 -1.379082 -0.591915
C  -1.973742 -0.819357 0.310555
C  -3.043246 1.198191 -0.834733
C  -1.423647 -0.176077 -2.185224
C  -4.474518 -1.395595 -0.139609
C  -0.712732 -1.557553 0.47193
C  -5.004144 -2.329374 0.655446
C  -6.452345 -2.30472 1.036564
C  -4.213464 -3.461758 1.233291
C  1.176344 -1.815376 1.871946
C  2.265188 -1.315023 0.965321
C  2.452062 0.053495 0.800775
C  3.110062 -2.209151 0.318628
C  3.473671 0.513366 -0.01727
C  4.144083 -1.735637 -0.47658
C  4.326804 -0.373708 -0.658724
C  2.672663 2.722685 -0.338891
C  1.573254 2.411861 -1.129987
C  2.775892 3.961597 0.277019
C  0.568469 3.354639 -1.293326
C  1.768482 4.89904 0.095065
C  0.659025 4.599448 -0.683652
H  -2.743808 -2.266129 -1.135381
H  -2.30997 -0.302806 1.202246
H  -2.305844 1.998817 -0.748361
H  -3.677948 1.238582 0.050208
H  -3.66616 1.417087 -1.704269
H  -0.600934 0.531485 -2.065959
H  -1.972469 0.110224 -3.084296
H  -0.999025 -1.160692 -2.366469
H  -5.120826 -0.605652 -0.511529
H  -6.570548 -2.253338 2.121874
H  -6.956607 -3.219614 0.715302
H  -6.978935 -1.457289 0.598187
H  -4.65486 -4.422124 0.955431
H  -4.23074 -3.422008 2.325576
H  -3.171759 -3.468024 0.916633
H  1.096229 -2.902728 1.822911
H  1.388179 -1.545851 2.906348
H  1.80818 0.757135 1.31539
H  2.962069 -3.274908 0.439184
H  4.803639 -2.432532 -0.976532
H  5.123512 -0.000818 -1.289552
H  1.497201 1.449626 -1.620845
H  3.638673 4.190839 0.88947
H  -0.287419 3.111861 -1.910121
H  1.851789 5.865917 0.573752
H  -0.126758 5.33056 -0.818116
elementType: O C H
totalener: -1117.85574169 hartree
nucrepener: 2284.47262674 hartree
electener: -3402.32836843 hartree
oneelecener: -6058.65686468 hartree
twoeener: 2656.32849625 hartree
cpcmener: -0.03027330 hartree
kineticenergy: 1112.80029950 hartree
xcener: -110.227529816423 hartree
chargesum: -0.0000000
charge: -0.296908 -0.502622 -0.344896 0.169624 -0.042659 -0.091378 -0.296904 -0.268437 -0.293380 0.410374 -0.009245 -0.229999 -0.246040 0.104129 0.024783 -0.226774 -0.217382 0.261270 -0.121379 -0.248219 0.280786 -0.181040 -0.251511 -0.157649 -0.121595 -0.198163 0.102464 0.092770 0.095131 0.094267 0.101562 0.077938 0.101768 0.095494 0.125950 0.094954 0.096139 0.089985 0.100594 0.098754 0.079366 0.117050 0.125536 0.142623 0.145914 0.161335 0.150031 0.166144 0.148323 0.169503 0.161068 0.160552
qa: -0.2969 -0.5026 -0.3449 0.1696 -0.0427 -0.0914 -0.2969 -0.2684 -0.2934 0.4104 -0.0092 -0.2300 -0.2460 0.1041 0.0248 -0.2268 -0.2174 0.2613 -0.1214 -0.2482 0.2808 -0.1810 -0.2515 -0.1576 -0.1216 -0.1982 0.1025 0.0928 0.0951 0.0943 0.1016 0.0779 0.1018 0.0955 0.1260 0.0950 0.0961 0.0900 0.1006 0.0988 0.0794 0.1171 0.1255 0.1426 0.1459 0.1613 0.1500 0.1661 0.1483 0.1695 0.1611 0.1606
va: 2.1092 1.9940 2.0579 3.6718 3.8383 3.8052 3.9193 3.8793 3.8855 4.1256 3.6987 3.9294 3.9403 3.7897 3.6154 3.9246 3.9486 3.7119 3.8929 4.0098 3.7100 3.8745 4.0064 3.8756 3.8829 3.9282 1.0257 1.0333 1.0056 1.0020 0.9984 1.0073 1.0024 1.0206 1.0028 0.9962 0.9960 1.0064 0.9991 0.9980 1.0158 1.0088 0.9930 1.0155 1.0034 0.9879 1.0048 0.9895 1.0070 0.9828 0.9873 0.9908
dispcorr: -0.026338936 hartree
energy: -1117.882080629929
dipole: -30.19561 29.20121 -0.99439 -6.19365 6.60985 0.41620 -1.36461 2.07177 0.70717
magnitude: 1.28923 au
magnitude: 3.27697 debye
