program: Orca
programVersion: 5.0.2
elementType: O O O C C C C C C C C C C C C C C C C C C C C C C C H H H H H H H H H H H H H H H H H H H H H H H H H H
charge: 0
multiplicity: 1
keywords: wb97x-d3
keywords: def2-TZVPP
keywords: def2/J RIJCOSX
keywords: DEFGRID2
keywords: scfconv7
keywords: smallprint printgap noloewdin
keywords: NOSOSCF
formula: C23H26O3
InChI: InChI=1/C23H26O3/c1-16(2)13-20-21(23(20,3)4)22(24)25-15-17-9-8-12-19(14-17)26-18-10-6-5-7-11-18/h5-14,20-21H,15H2,1-4H3
52 atoms
O  0.133475 -2.002264 -1.741852
O  -0.601002 -0.03785 -0.963885
O  3.916626 1.725882 0.749977
C  -2.276599 -2.149243 0.752524
C  -3.163388 -1.338573 -0.149826
C  -1.942179 -2.009458 -0.724723
C  -2.727368 -3.51642 1.202423
C  -1.456244 -1.425435 1.791241
C  -4.500572 -1.816159 -0.564355
C  -0.769884 -1.222484 -1.145201
C  -5.665553 -1.203353 -0.33294
C  -6.955075 -1.803305 -0.807331
C  -5.814319 0.089403 0.408445
C  1.40639 -1.426624 -2.056357
C  2.180311 -1.102521 -0.809771
C  2.690838 0.173747 -0.6258
C  2.373171 -2.07271 0.171407
C  3.375635 0.481447 0.542734
C  3.067195 -1.755892 1.328053
C  3.565005 -0.474612 1.526827
C  3.16948 2.844132 0.476473
C  1.792601 2.88877 0.664163
C  3.861875 3.968307 0.047046
C  1.113375 4.071949 0.41001
C  3.169512 5.146219 -0.193764
C  1.793423 5.203878 -0.019043
H  -3.066231 -0.266455 -0.012561
H  -2.110335 -2.908478 -1.308492
H  -3.2593 -4.06298 0.425103
H  -3.390827 -3.43355 2.065355
H  -1.869371 -4.120268 1.502733
H  -2.015261 -1.376631 2.727835
H  -1.21024 -0.403152 1.51015
H  -0.522188 -1.954247 1.9941
H  -4.524938 -2.760572 -1.100893
H  -7.621081 -2.015323 0.033108
H  -6.799822 -2.731951 -1.3562
H  -7.493463 -1.111209 -1.459859
H  -6.445264 -0.050676 1.289148
H  -6.316792 0.83451 -0.212193
H  -4.871373 0.514298 0.74429
H  1.28791 -0.545012 -2.68877
H  1.912867 -2.19247 -2.642394
H  2.53965 0.926827 -1.390186
H  1.983177 -3.073739 0.036172
H  3.216274 -2.508013 2.091273
H  4.096279 -0.222311 2.435521
H  1.245877 2.017637 1.002843
H  4.934154 3.920585 -0.094793
H  0.041572 4.10516 0.555405
H  3.712373 6.020482 -0.528386
H  1.255902 6.122032 -0.214338
elementType: O C H
totalener: -1117.85597359 hartree
nucrepener: 2239.22096246 hartree
electener: -3357.07693605 hartree
oneelecener: -5968.57413566 hartree
twoeener: 2611.49719961 hartree
cpcmener: -0.03047227 hartree
kineticenergy: 1112.81008575 hartree
xcener: -110.229177035193 hartree
chargesum: 0.0000000
charge: -0.286942 -0.491108 -0.343516 0.132671 0.026922 -0.111065 -0.268649 -0.280228 -0.288930 0.398078 -0.041282 -0.222002 -0.251575 0.094546 0.052106 -0.214976 -0.282074 0.278911 -0.104830 -0.245142 0.285625 -0.181217 -0.250341 -0.162185 -0.127569 -0.188771 0.092093 0.093386 0.089889 0.097666 0.098718 0.102408 0.089094 0.094124 0.122580 0.093825 0.088794 0.093955 0.096480 0.096220 0.089420 0.117558 0.127226 0.146285 0.143110 0.160876 0.149628 0.158286 0.147496 0.161986 0.161192 0.161249
qa: -0.2869 -0.4911 -0.3435 0.1327 0.0269 -0.1111 -0.2686 -0.2802 -0.2889 0.3981 -0.0413 -0.2220 -0.2516 0.0945 0.0521 -0.2150 -0.2821 0.2789 -0.1048 -0.2451 0.2856 -0.1812 -0.2503 -0.1622 -0.1276 -0.1888 0.0921 0.0934 0.0899 0.0977 0.0987 0.1024 0.0891 0.0941 0.1226 0.0938 0.0888 0.0940 0.0965 0.0962 0.0894 0.1176 0.1272 0.1463 0.1431 0.1609 0.1496 0.1583 0.1475 0.1620 0.1612 0.1612
va: 2.1140 2.0079 2.0597 3.6752 3.7854 3.8405 3.9010 3.9047 3.8694 4.1938 3.7390 3.9215 3.9431 3.7901 3.5646 3.9368 3.9394 3.6969 3.8588 4.0194 3.6854 3.8774 3.9972 3.9031 3.8838 3.8973 1.0309 1.0371 1.0040 1.0023 1.0024 1.0023 1.0139 1.0015 1.0081 0.9962 1.0084 0.9959 0.9970 0.9972 1.0092 1.0088 0.9930 1.0067 1.0112 0.9875 1.0046 0.9966 1.0079 0.9903 0.9878 0.9892
dispcorr: -0.024903611 hartree
energy: -1117.880877201804
dipole: -32.99086 32.26112 -0.72975 -10.73903 9.65118 -1.08785 5.25819 -5.26920 -0.01102
magnitude: 1.30999 au
magnitude: 3.32972 debye
