program: Orca
programVersion: 5.0.2
elementType: O O O C C C C C C C C C C C C C C C C C C C C C C C H H H H H H H H H H H H H H H H H H H H H H H H H H
charge: 0
multiplicity: 1
keywords: wb97x-d3
keywords: def2-TZVPP
keywords: def2/J RIJCOSX
keywords: DEFGRID2
keywords: scfconv7
keywords: smallprint printgap noloewdin
keywords: NOSOSCF
formula: C23H26O3
InChI: InChI=1/C23H26O3/c1-16(2)13-20-21(23(20,3)4)22(24)25-15-17-9-8-12-19(14-17)26-18-10-6-5-7-11-18/h5-14,20-21H,15H2,1-4H3
52 atoms
O  0.130528 -2.041182 -1.656134
O  -0.62379 -0.058173 -0.948994
O  3.930677 1.816966 0.597213
C  -2.335685 -2.036206 0.852789
C  -3.199722 -1.352643 -0.164274
C  -1.935897 -2.035058 -0.616833
C  -2.777522 -3.365816 1.409613
C  -1.582043 -1.193207 1.850987
C  -4.509209 -1.910036 -0.587768
C  -0.7757 -1.252384 -1.075703
C  -5.694388 -1.520782 -0.111037
C  -6.971996 -2.119881 -0.613682
C  -5.855747 -0.472757 0.9464
C  1.377732 -1.453182 -2.043995
C  2.203586 -1.083279 -0.844159
C  2.6789 0.212668 -0.702943
C  2.485016 -2.034527 0.13377
C  3.41361 0.558626 0.424177
C  3.231497 -1.680551 1.246162
C  3.692357 -0.380525 1.404303
C  3.183669 2.928037 0.300795
C  3.890442 4.058814 -0.087928
C  1.800126 2.968814 0.430691
C  3.206895 5.236893 -0.349091
C  1.129883 4.152619 0.154329
C  1.824153 5.289619 -0.235854
H  -3.141283 -0.268281 -0.135187
H  -2.055216 -2.991689 -1.114891
H  -3.483873 -3.218858 2.229432
H  -1.923968 -3.919773 1.804627
H  -3.26275 -3.992881 0.662399
H  -1.370569 -0.187679 1.492852
H  -0.634307 -1.661063 2.12574
H  -2.174201 -1.093369 2.762632
H  -4.48878 -2.690853 -1.342878
H  -7.624729 -1.351533 -1.036115
H  -7.532874 -2.585612 0.200568
H  -6.799318 -2.874297 -1.380893
H  -6.439617 -0.862933 1.783722
H  -6.41041 0.386898 0.561273
H  -4.908319 -0.111291 1.34303
H  1.214493 -0.591902 -2.694052
H  1.870512 -2.22657 -2.631963
H  2.462476 0.948195 -1.46846
H  2.12482 -3.050224 0.028747
H  3.451807 -2.418437 2.006048
H  4.265893 -0.099169 2.278137
H  4.968121 4.014882 -0.181616
H  1.239709 2.096274 0.741521
H  3.762126 6.115342 -0.650801
H  0.052729 4.181914 0.253209
H  1.292974 6.207814 -0.44746
elementType: O C H
totalener: -1117.85532485 hartree
nucrepener: 2232.39908237 hartree
electener: -3350.25440722 hartree
oneelecener: -5954.91887504 hartree
twoeener: 2604.66446782 hartree
cpcmener: -0.02942075 hartree
kineticenergy: 1112.80487694 hartree
xcener: -110.227544006946 hartree
chargesum: 0.0000000
charge: -0.289726 -0.494407 -0.340049 0.143027 -0.009370 -0.115766 -0.274184 -0.291631 -0.268399 0.410770 -0.034874 -0.230925 -0.251480 0.096056 0.042106 -0.229309 -0.271297 0.301713 -0.105256 -0.256552 0.311815 -0.263822 -0.202533 -0.120338 -0.154370 -0.195496 0.098717 0.094019 0.097331 0.100246 0.092659 0.090454 0.098786 0.099992 0.124037 0.095143 0.094560 0.090113 0.096255 0.101725 0.087491 0.116892 0.127484 0.146788 0.142639 0.160944 0.149247 0.146971 0.157498 0.161131 0.162178 0.160996
qa: -0.2897 -0.4944 -0.3400 0.1430 -0.0094 -0.1158 -0.2742 -0.2916 -0.2684 0.4108 -0.0349 -0.2309 -0.2515 0.0961 0.0421 -0.2293 -0.2713 0.3017 -0.1053 -0.2566 0.3118 -0.2638 -0.2025 -0.1203 -0.1544 -0.1955 0.0987 0.0940 0.0973 0.1002 0.0927 0.0905 0.0988 0.1000 0.1240 0.0951 0.0946 0.0901 0.0963 0.1017 0.0875 0.1169 0.1275 0.1468 0.1426 0.1609 0.1492 0.1470 0.1575 0.1611 0.1622 0.1610
va: 2.1151 2.0062 2.0681 3.6692 3.7976 3.8510 3.9034 3.9025 3.8635 4.1857 3.7007 3.9269 3.9388 3.7912 3.5834 3.9372 3.9543 3.6802 3.8671 4.0233 3.6702 4.0017 3.8914 3.8774 3.8961 3.9050 1.0240 1.0367 1.0017 1.0028 1.0019 1.0148 1.0008 1.0023 1.0061 0.9950 0.9964 1.0074 0.9980 0.9978 1.0077 1.0095 0.9926 1.0066 1.0109 0.9876 1.0055 1.0087 0.9977 0.9878 0.9899 0.9895
dispcorr: -0.024927846 hartree
energy: -1117.880252694997
dipole: -33.35961 32.59503 -0.76458 -11.58559 10.49436 -1.09123 7.00896 -6.93455 0.07441
magnitude: 1.33450 au
magnitude: 3.39204 debye
