program: Orca
programVersion: 5.0.2
elementType: O O O C C C C C C C C C C C C C C C C C C C C C C C H H H H H H H H H H H H H H H H H H H H H H H H H H
charge: 0
multiplicity: 1
keywords: wb97x-d3
keywords: def2-TZVPP
keywords: def2/J RIJCOSX
keywords: DEFGRID2
keywords: scfconv7
keywords: smallprint printgap noloewdin
keywords: NOSOSCF
formula: C23H26O3
InChI: InChI=1/C23H26O3/c1-16(2)13-20-21(23(20,3)4)22(24)25-15-17-9-8-12-19(14-17)26-18-10-6-5-7-11-18/h5-14,20-21H,15H2,1-4H3
52 atoms
O  0.471402 -2.848727 0.192703
O  -0.177279 -1.289719 1.662694
O  2.737692 2.20547 0.061997
C  -3.075069 -1.938734 0.687438
C  -2.52366 -0.827116 -0.132446
C  -1.718377 -2.114517 0.028922
C  -4.168905 -2.800616 0.102835
C  -3.198063 -1.764982 2.181204
C  -3.070469 -0.445207 -1.459153
C  -0.433175 -2.027133 0.736214
C  -2.352941 0.060642 -2.466559
C  -2.999628 0.472115 -3.753574
C  -0.870492 0.26772 -2.408437
C  1.861667 -2.607939 0.475687
C  2.307212 -1.414898 -0.319581
C  2.400808 -0.166207 0.279819
C  2.520554 -1.53729 -1.690962
C  2.656544 0.954699 -0.498723
C  2.81549 -0.416864 -2.450835
C  2.867095 0.840611 -1.862981
C  1.767105 2.601922 0.948726
C  0.440898 2.200412 0.833484
C  2.15701 3.472153 1.957207
C  -0.491181 2.670011 1.747716
C  1.210857 3.94172 2.857194
C  -0.114645 3.540234 2.761855
H  -2.119877 -0.001095 0.449914
H  -1.710007 -2.771935 -0.832443
H  -5.146644 -2.342534 0.263614
H  -4.180457 -3.779484 0.585235
H  -4.048414 -2.962682 -0.968288
H  -3.042873 -2.711674 2.70173
H  -4.205697 -1.421357 2.422137
H  -2.501968 -1.035994 2.588158
H  -4.142734 -0.556576 -1.595672
H  -2.8294 1.533122 -3.953346
H  -4.075346 0.298445 -3.748316
H  -2.571466 -0.072641 -4.598692
H  -0.416798 -0.101356 -1.490214
H  -0.626027 1.329357 -2.498907
H  -0.380743 -0.231071 -3.248364
H  2.371674 -3.51394 0.15392
H  2.034476 -2.480128 1.544407
H  2.257832 -0.066544 1.348316
H  2.454407 -2.509486 -2.163573
H  2.987174 -0.514348 -3.514557
H  3.071691 1.721569 -2.457757
H  0.125748 1.532278 0.04241
H  3.192136 3.779319 2.035966
H  -1.522109 2.352653 1.656367
H  1.517936 4.61982 3.64255
H  -0.847354 3.90257 3.470327
elementType: O C H
totalener: -1117.85332614 hartree
nucrepener: 2374.02128886 hartree
electener: -3491.87461500 hartree
oneelecener: -6238.02484417 hartree
twoeener: 2746.15022917 hartree
cpcmener: -0.02906387 hartree
kineticenergy: 1112.80706930 hartree
xcener: -110.229192224639 hartree
chargesum: 0.0000000
charge: -0.293281 -0.496831 -0.344858 0.183289 -0.028057 -0.068681 -0.293766 -0.285104 -0.294728 0.373285 0.000083 -0.232501 -0.209177 0.084364 -0.005197 -0.162512 -0.213956 0.267753 -0.140313 -0.236041 0.246860 -0.138019 -0.219590 -0.210564 -0.147798 -0.161132 0.087860 0.092378 0.099805 0.098720 0.093681 0.100994 0.094590 0.089165 0.124358 0.096547 0.090513 0.096428 0.011610 0.108089 0.107985 0.126064 0.115112 0.143527 0.144452 0.160962 0.147806 0.161827 0.147712 0.164635 0.160626 0.161026
qa: -0.2933 -0.4968 -0.3449 0.1833 -0.0281 -0.0687 -0.2938 -0.2851 -0.2947 0.3733 0.0001 -0.2325 -0.2092 0.0844 -0.0052 -0.1625 -0.2140 0.2678 -0.1403 -0.2360 0.2469 -0.1380 -0.2196 -0.2106 -0.1478 -0.1611 0.0879 0.0924 0.0998 0.0987 0.0937 0.1010 0.0946 0.0892 0.1244 0.0965 0.0905 0.0964 0.0116 0.1081 0.1080 0.1261 0.1151 0.1435 0.1445 0.1610 0.1478 0.1618 0.1477 0.1646 0.1606 0.1610
va: 2.1046 1.9894 2.0675 3.6823 3.8260 3.8017 3.9140 3.8843 3.8635 4.1463 3.7603 3.9300 3.9202 3.8117 3.6115 3.8850 3.9226 3.7015 3.8520 3.9733 3.7282 3.8132 3.9661 3.9334 3.9064 3.8767 1.0238 1.0329 0.9996 1.0025 1.0011 0.9988 1.0009 1.0188 1.0042 0.9956 1.0060 0.9967 1.0226 0.9972 1.0012 0.9949 1.0114 1.0188 1.0034 0.9884 1.0054 0.9634 1.0075 0.9895 0.9879 0.9896
dispcorr: -0.030003098 hartree
energy: -1117.883329242231
dipole: -22.79020 22.22799 -0.56221 -5.56239 4.87083 -0.69156 -7.98689 6.91197 -1.07492
magnitude: 1.39635 au
magnitude: 3.54924 debye
