program: Orca
programVersion: 5.0.2
elementType: O O O C C C C C C C C C C C C C C C C C C C C C C C H H H H H H H H H H H H H H H H H H H H H H H H H H
charge: 0
multiplicity: 1
keywords: wb97x-d3
keywords: def2-TZVPP
keywords: def2/J RIJCOSX
keywords: DEFGRID2
keywords: scfconv7
keywords: smallprint printgap noloewdin
keywords: NOSOSCF
formula: C23H26O3
InChI: InChI=1/C23H26O3/c1-16(2)13-20-21(23(20,3)4)22(24)25-15-17-9-8-12-19(14-17)26-18-10-6-5-7-11-18/h5-14,20-21H,15H2,1-4H3
52 atoms
O  0.338387 -2.066089 -1.400605
O  0.054587 -3.042623 0.588527
O  2.008419 2.116038 1.033831
C  -3.00017 -2.946373 -0.196321
C  -2.667398 -1.795701 0.684052
C  -1.813139 -2.059447 -0.547259
C  -4.172436 -2.829086 -1.141039
C  -2.793706 -4.348834 0.318982
C  -3.497323 -0.566341 0.757243
C  -0.410918 -2.459195 -0.365162
C  -3.01373 0.66019 0.970223
C  -3.913983 1.853886 1.05079
C  -1.55383 0.95357 1.126271
C  1.752385 -2.22856 -1.2886
C  2.351308 -1.306928 -0.261281
C  1.884213 -0.002011 -0.133158
C  3.390687 -1.751582 0.546905
C  2.465402 0.845422 0.800277
C  3.966483 -0.892407 1.471775
C  3.511288 0.409617 1.603119
C  1.547701 2.915863 0.020586
C  0.537044 3.808408 0.353152
C  2.087691 2.903386 -1.259548
C  0.05719 4.687563 -0.605775
C  1.58879 3.781755 -2.211938
C  0.574267 4.674303 -1.894058
H  -2.173375 -2.072975 1.612664
H  -1.980993 -1.395754 -1.38737
H  -4.053516 -3.515903 -1.980662
H  -4.283594 -1.824469 -1.548896
H  -5.102885 -3.08801 -0.631805
H  -3.718349 -4.705108 0.776617
H  -2.012338 -4.4177 1.07204
H  -2.545059 -5.034156 -0.493302
H  -4.57134 -0.690122 0.650212
H  -3.639901 2.598633 0.299127
H  -3.82255 2.347998 2.021114
H  -4.960864 1.590713 0.901865
H  -0.934611 0.059813 1.170992
H  -1.372351 1.53279 2.034747
H  -1.200357 1.56814 0.294366
H  2.133487 -1.98928 -2.281532
H  2.012715 -3.267553 -1.077994
H  1.064744 0.347278 -0.749312
H  3.745646 -2.770628 0.458366
H  4.77428 -1.240035 2.101895
H  3.953153 1.080093 2.328856
H  0.130451 3.812823 1.35637
H  2.887859 2.223697 -1.52216
H  -0.731135 5.380225 -0.341992
H  2.006827 3.76762 -3.209934
H  0.192143 5.355202 -2.642567
elementType: O C H
totalener: -1117.85503003 hartree
nucrepener: 2322.24350640 hartree
electener: -3440.09853643 hartree
oneelecener: -6134.29792088 hartree
twoeener: 2694.19938445 hartree
cpcmener: -0.03004576 hartree
kineticenergy: 1112.80836394 hartree
xcener: -110.231814288200 hartree
chargesum: 0.0000000
charge: -0.297931 -0.498701 -0.344120 0.162069 -0.012796 -0.090302 -0.288336 -0.280983 -0.303184 0.385099 0.010244 -0.232697 -0.267842 0.105766 0.029883 -0.290370 -0.231259 0.353201 -0.106021 -0.281525 0.333816 -0.299051 -0.216910 -0.105972 -0.142641 -0.197253 0.103243 0.092630 0.098315 0.094121 0.099592 0.095604 0.090606 0.099998 0.124511 0.093287 0.096725 0.091376 0.084022 0.106492 0.101322 0.122935 0.115559 0.147135 0.144737 0.161173 0.148228 0.153022 0.158197 0.161071 0.162754 0.161165
qa: -0.2979 -0.4987 -0.3441 0.1621 -0.0128 -0.0903 -0.2883 -0.2810 -0.3032 0.3851 0.0102 -0.2327 -0.2678 0.1058 0.0299 -0.2904 -0.2313 0.3532 -0.1060 -0.2815 0.3338 -0.2991 -0.2169 -0.1060 -0.1426 -0.1973 0.1032 0.0926 0.0983 0.0941 0.0996 0.0956 0.0906 0.1000 0.1245 0.0933 0.0967 0.0914 0.0840 0.1065 0.1013 0.1229 0.1156 0.1471 0.1447 0.1612 0.1482 0.1530 0.1582 0.1611 0.1628 0.1612
va: 2.1049 1.9960 2.0459 3.6941 3.8070 3.7910 3.9099 3.8881 3.9006 4.1384 3.6981 3.9279 3.9493 3.7894 3.6562 3.9351 3.9748 3.5950 3.8752 4.0409 3.6082 3.9718 3.9131 3.8592 3.8834 3.9126 1.0255 1.0331 1.0028 1.0012 0.9997 1.0006 1.0189 0.9990 1.0025 0.9972 0.9964 1.0061 1.0121 0.9998 0.9955 0.9923 1.0095 1.0093 1.0020 0.9875 1.0067 1.0043 0.9971 0.9881 0.9887 0.9895
dispcorr: -0.027667819 hartree
energy: -1117.882697849202
dipole: -22.70821 22.34660 -0.36161 -4.08567 4.64191 0.55624 -0.76012 -0.51385 -1.27397
magnitude: 1.43637 au
magnitude: 3.65096 debye
