program: Orca
programVersion: 5.0.2
elementType: O O O C C C C C C C C C C C C C C C C C C C C C C C H H H H H H H H H H H H H H H H H H H H H H H H H H
charge: 0
multiplicity: 1
keywords: wb97x-d3
keywords: def2-TZVPP
keywords: def2/J RIJCOSX
keywords: DEFGRID2
keywords: scfconv7
keywords: smallprint printgap noloewdin
keywords: NOSOSCF
formula: C23H26O3
InChI: InChI=1/C23H26O3/c1-16(2)13-20-21(23(20,3)4)22(24)25-15-17-9-8-12-19(14-17)26-18-10-6-5-7-11-18/h5-14,20-21H,15H2,1-4H3
52 atoms
O  0.374495 -2.001252 -1.467598
O  0.087658 -3.029114 0.496386
O  2.102072 2.075511 1.104675
C  -2.966083 -2.917129 -0.357727
C  -2.658719 -1.825169 0.603749
C  -1.775048 -2.006752 -0.619258
C  -4.112434 -2.742573 -1.324076
C  -2.760897 -4.347579 0.074392
C  -3.492011 -0.602482 0.73321
C  -0.375764 -2.419422 -0.441196
C  -3.009065 0.610629 1.013564
C  -3.90623 1.802794 1.142312
C  -1.549242 0.889896 1.198492
C  1.783765 -2.187736 -1.376331
C  2.423589 -1.284101 -0.356699
C  1.925981 -0.003958 -0.130467
C  3.551181 -1.720053 0.329192
C  2.568836 0.830693 0.77439
C  4.186206 -0.874503 1.227181
C  3.704216 0.404771 1.451617
C  1.486532 2.890147 0.190826
C  1.835525 2.925064 -1.15352
C  0.51486 3.748312 0.690945
C  1.178689 3.808387 -1.999533
C  -0.123322 4.633616 -0.16388
C  0.197816 4.662501 -1.514701
H  -2.189264 -2.162686 1.525083
H  -1.922488 -1.290215 -1.419082
H  -3.966184 -3.37026 -2.204838
H  -4.216787 -1.713299 -1.666983
H  -5.05589 -3.037457 -0.860744
H  -2.4922 -4.981639 -0.772396
H  -3.690432 -4.73695 0.49386
H  -1.992539 -4.456681 0.836606
H  -4.564724 -0.721649 0.607414
H  -4.95071 1.553945 0.95586
H  -3.61269 2.587928 0.440638
H  -3.83457 2.240755 2.140969
H  -1.17459 1.506264 0.377181
H  -0.937574 -0.009009 1.24893
H  -1.37869 1.462092 2.113469
H  2.156181 -1.949999 -2.372961
H  2.031172 -3.232103 -1.176758
H  1.04005 0.33604 -0.652227
H  3.929865 -2.720975 0.163857
H  5.063787 -1.214503 1.760951
H  4.19344 1.066899 2.154442
H  2.606889 2.275946 -1.547116
H  0.260418 3.716473 1.742877
H  1.444761 3.828449 -3.048185
H  -0.881519 5.297612 0.230247
H  -0.308907 5.346387 -2.182289
elementType: O C H
totalener: -1117.85468669 hartree
nucrepener: 2325.55318557 hartree
electener: -3443.40787226 hartree
oneelecener: -6140.85004697 hartree
twoeener: 2697.44217471 hartree
cpcmener: -0.03000491 hartree
kineticenergy: 1112.80352418 hartree
xcener: -110.231464903840 hartree
chargesum: 0.0000000
charge: -0.299037 -0.496574 -0.342638 0.160626 -0.010353 -0.085968 -0.287624 -0.279637 -0.306165 0.382973 0.014584 -0.231777 -0.268633 0.103650 0.025139 -0.293790 -0.236820 0.364714 -0.105515 -0.279990 0.342234 -0.225751 -0.300724 -0.139216 -0.105407 -0.197404 0.102450 0.091867 0.097979 0.093808 0.099927 0.100110 0.095770 0.090156 0.124334 0.091598 0.091994 0.097095 0.096362 0.086693 0.105961 0.122731 0.115408 0.147559 0.144224 0.161256 0.147875 0.159876 0.148526 0.162853 0.161154 0.161535
qa: -0.2990 -0.4966 -0.3426 0.1606 -0.0104 -0.0860 -0.2876 -0.2796 -0.3062 0.3830 0.0146 -0.2318 -0.2686 0.1037 0.0251 -0.2938 -0.2368 0.3647 -0.1055 -0.2800 0.3422 -0.2258 -0.3007 -0.1392 -0.1054 -0.1974 0.1025 0.0919 0.0980 0.0938 0.0999 0.1001 0.0958 0.0902 0.1243 0.0916 0.0920 0.0971 0.0964 0.0867 0.1060 0.1227 0.1154 0.1476 0.1442 0.1613 0.1479 0.1599 0.1485 0.1629 0.1612 0.1615
va: 2.1048 1.9976 2.0544 3.7001 3.8048 3.7836 3.9089 3.8907 3.9022 4.1373 3.6818 3.9283 3.9519 3.7907 3.6696 3.9449 3.9815 3.5955 3.8746 4.0339 3.5878 3.9085 3.9677 3.8820 3.8458 3.9130 1.0256 1.0338 1.0029 1.0015 0.9997 0.9992 1.0007 1.0182 1.0026 1.0062 0.9977 0.9966 0.9981 1.0125 0.9996 0.9917 1.0106 1.0067 1.0020 0.9875 1.0071 0.9962 1.0081 0.9887 0.9878 0.9891
dispcorr: -0.027814997 hartree
energy: -1117.882501686508
dipole: -22.88796 22.46309 -0.42487 -4.12813 4.69514 0.56702 -1.10501 -0.18666 -1.29167
magnitude: 1.47324 au
magnitude: 3.74468 debye
