program: Orca
programVersion: 5.0.2
elementType: O O O C C C C C C C C C C C C C C C C C C C C C C C H H H H H H H H H H H H H H H H H H H H H H H H H H
charge: 0
multiplicity: 1
keywords: wb97x-d3
keywords: def2-TZVPP
keywords: def2/J RIJCOSX
keywords: DEFGRID2
keywords: scfconv7
keywords: smallprint printgap noloewdin
keywords: NOSOSCF
formula: C23H26O3
InChI: InChI=1/C23H26O3/c1-16(2)13-20-21(23(20,3)4)22(24)25-15-17-9-8-12-19(14-17)26-18-10-6-5-7-11-18/h5-14,20-21H,15H2,1-4H3
52 atoms
O  -0.441143 -2.00065 -1.450178
O  -0.512514 -2.627845 0.693496
O  3.601286 1.883755 0.801208
C  -3.116602 -4.144741 -0.246035
C  -3.483918 -2.868097 0.42528
C  -2.453549 -2.850852 -0.69556
C  -4.065747 -4.751538 -1.25286
C  -2.336329 -5.179203 0.528162
C  -4.793348 -2.194432 0.241496
C  -1.059405 -2.505106 -0.376506
C  -5.02824 -0.908095 0.516459
C  -6.388303 -0.306046 0.336892
C  -3.975477 0.037443 1.007337
C  0.889406 -1.529826 -1.294094
C  0.966788 -0.18959 -0.611301
C  2.220987 0.265392 -0.211154
C  -0.144734 0.621636 -0.418973
C  2.352676 1.50845 0.383205
C  -0.00026 1.860899 0.193911
C  1.242389 2.316362 0.601028
C  4.093231 3.108275 0.445206
C  3.787735 3.715585 -0.767705
C  4.971002 3.713209 1.335937
C  4.363728 4.940109 -1.076645
C  5.543955 4.933193 1.009086
C  5.240923 5.555615 -0.194433
H  -3.036975 -2.740465 1.408321
H  -2.798204 -2.475209 -1.652447
H  -4.573854 -4.003162 -1.86162
H  -4.830432 -5.350244 -0.752307
H  -3.525876 -5.412909 -1.933529
H  -1.730129 -4.753012 1.32482
H  -1.677084 -5.749182 -0.129683
H  -3.028421 -5.886905 0.990447
H  -5.617379 -2.802186 -0.121397
H  -6.359286 0.523948 -0.374515
H  -6.762698 0.107832 1.277033
H  -7.116953 -1.032209 -0.024105
H  -3.847491 0.865449 0.304014
H  -3.002209 -0.429898 1.150961
H  -4.272395 0.489082 1.957738
H  1.278158 -1.449498 -2.310043
H  1.506434 -2.262874 -0.770019
H  3.101065 -0.351042 -0.359993
H  -1.130515 0.307179 -0.737054
H  -0.873326 2.479924 0.357761
H  1.344135 3.280687 1.083224
H  3.115015 3.244343 -1.473223
H  5.20359 3.229188 2.276355
H  4.124598 5.410722 -2.021653
H  6.227267 5.40112 1.706118
H  5.686046 6.50976 -0.443784
elementType: O C H
totalener: -1117.86895246 hartree
nucrepener: 2176.43664930 hartree
electener: -3294.30560175 hartree
oneelecener: -5842.35368403 hartree
twoeener: 2548.04808228 hartree
cpcmener: -0.02572210 hartree
kineticenergy: 1112.78251292 hartree
xcener: -110.223913570718 hartree
chargesum: 0.0000000
charge: -0.294865 -0.464817 -0.329955 0.160782 -0.031641 -0.069517 -0.294692 -0.274256 -0.286325 0.352697 0.002710 -0.230486 -0.265931 0.088076 0.035780 -0.252063 -0.219991 0.235832 -0.140557 -0.178144 0.271283 -0.175296 -0.242913 -0.159088 -0.126535 -0.184797 0.101295 0.091354 0.090072 0.101523 0.098176 0.092930 0.098686 0.094101 0.123922 0.094466 0.095091 0.088738 0.099684 0.078492 0.103527 0.128775 0.116396 0.130674 0.159510 0.155491 0.157585 0.154225 0.145712 0.158873 0.157406 0.158005
qa: -0.2949 -0.4648 -0.3300 0.1608 -0.0316 -0.0695 -0.2947 -0.2743 -0.2863 0.3527 0.0027 -0.2305 -0.2659 0.0881 0.0358 -0.2521 -0.2200 0.2358 -0.1406 -0.1781 0.2713 -0.1753 -0.2429 -0.1591 -0.1265 -0.1848 0.1013 0.0914 0.0901 0.1015 0.0982 0.0929 0.0987 0.0941 0.1239 0.0945 0.0951 0.0887 0.0997 0.0785 0.1035 0.1288 0.1164 0.1307 0.1595 0.1555 0.1576 0.1542 0.1457 0.1589 0.1574 0.1580
va: 2.1120 2.0328 2.0643 3.7249 3.8259 3.7837 3.9151 3.8836 3.8952 4.1637 3.6897 3.9298 3.9499 3.8057 3.6667 4.0870 3.9344 3.7547 3.9132 3.9362 3.7055 3.8786 3.9946 3.9081 3.8954 3.9009 1.0241 1.0335 1.0014 0.9985 1.0027 1.0188 0.9998 1.0009 1.0033 0.9962 0.9959 1.0069 0.9950 1.0120 1.0010 0.9905 1.0132 1.0170 0.9948 0.9945 0.9949 0.9989 1.0084 0.9908 0.9891 0.9903
dispcorr: -0.024308158 hartree
energy: -1117.893260614014
dipole: -30.22257 29.36011 -0.86246 -12.44264 12.94652 0.50388 -0.92693 -0.20409 -1.13102
magnitude: 1.50896 au
magnitude: 3.83546 debye
