program: Orca
programVersion: 5.0.2
elementType: O O O C C C C C C C C C C C C C C C C C C C C C C C H H H H H H H H H H H H H H H H H H H H H H H H H H
charge: 0
multiplicity: 1
keywords: wb97x-d3
keywords: def2-TZVPP
keywords: def2/J RIJCOSX
keywords: DEFGRID2
keywords: scfconv7
keywords: smallprint printgap noloewdin
keywords: NOSOSCF
formula: C23H26O3
InChI: InChI=1/C23H26O3/c1-16(2)13-20-21(23(20,3)4)22(24)25-15-17-9-8-12-19(14-17)26-18-10-6-5-7-11-18/h5-14,20-21H,15H2,1-4H3
52 atoms
O  0.334803 -2.202163 -0.279918
O  -0.635204 -3.573264 -1.748893
O  2.701132 2.198725 -0.128557
C  -2.577613 -2.216165 0.930545
C  -2.117676 -0.89736 0.404038
C  -2.007674 -2.124218 -0.476674
C  -4.057408 -2.503777 1.004987
C  -1.786311 -2.87896 2.031151
C  -3.052924 0.202367 0.049716
C  -0.721355 -2.717098 -0.898496
C  -2.856098 1.072427 -0.944569
C  -3.819907 2.185677 -1.217801
C  -1.668603 1.024056 -1.85425
C  1.644883 -2.555392 -0.723063
C  2.575743 -1.459869 -0.291094
C  2.186546 -0.13045 -0.414865
C  3.841699 -1.761438 0.197092
C  3.046945 0.880285 -0.014509
C  4.708285 -0.739089 0.558229
C  4.313729 0.587014 0.469862
C  1.456835 2.619068 0.252699
C  0.760441 2.043348 1.310355
C  0.92479 3.701845 -0.434476
C  -0.478963 2.555998 1.665405
C  -0.310112 4.211729 -0.058477
C  -1.02044 3.640485 0.988416
H  -1.170597 -0.561311 0.819871
H  -2.753936 -2.217974 -1.258647
H  -4.241771 -3.579404 0.971982
H  -4.613539 -2.050568 0.183922
H  -4.478675 -2.127658 1.939912
H  -2.190935 -2.589565 3.00333
H  -0.732844 -2.604117 2.02632
H  -1.850415 -3.966924 1.961484
H  -3.933578 0.320542 0.675457
H  -4.647065 2.201066 -0.507897
H  -4.240559 2.103025 -2.223777
H  -3.318618 3.156531 -1.174357
H  -1.983602 0.956211 -2.899556
H  -1.003624 0.186883 -1.651132
H  -1.083816 1.944196 -1.769037
H  1.660111 -2.660301 -1.810699
H  1.941739 -3.514288 -0.292352
H  1.21329 0.12144 -0.818282
H  4.15138 -2.794214 0.29971
H  5.694789 -0.976823 0.934405
H  4.978791 1.385781 0.77279
H  1.172618 1.208423 1.862411
H  1.476731 4.143116 -1.255116
H  -1.019297 2.103994 2.487291
H  -0.71916 5.058264 -0.59504
H  -1.985868 4.036173 1.274931
elementType: O C H
totalener: -1117.86579986 hartree
nucrepener: 2367.94172025 hartree
electener: -3485.80752011 hartree
oneelecener: -6224.72895161 hartree
twoeener: 2738.92143150 hartree
cpcmener: -0.02521260 hartree
kineticenergy: 1112.80413375 hartree
xcener: -110.230128256991 hartree
chargesum: -0.0000000
charge: -0.280101 -0.470117 -0.329046 0.142636 0.036711 -0.124557 -0.294621 -0.275476 -0.306203 0.415095 -0.016097 -0.225391 -0.247102 0.054144 0.008335 -0.197606 -0.214229 0.266014 -0.111797 -0.248119 0.310550 -0.201179 -0.246176 -0.154575 -0.123004 -0.192711 0.089319 0.094534 0.098217 0.092413 0.097258 0.094943 0.088327 0.100476 0.119686 0.091059 0.102900 0.086162 0.113468 0.069994 0.093575 0.117167 0.116082 0.144001 0.141253 0.157113 0.145953 0.154842 0.143179 0.158479 0.155482 0.158741
qa: -0.2801 -0.4701 -0.3290 0.1426 0.0367 -0.1246 -0.2946 -0.2755 -0.3062 0.4151 -0.0161 -0.2254 -0.2471 0.0541 0.0083 -0.1976 -0.2142 0.2660 -0.1118 -0.2481 0.3105 -0.2012 -0.2462 -0.1546 -0.1230 -0.1927 0.0893 0.0945 0.0982 0.0924 0.0973 0.0949 0.0883 0.1005 0.1197 0.0911 0.1029 0.0862 0.1135 0.0700 0.0936 0.1172 0.1161 0.1440 0.1413 0.1571 0.1460 0.1548 0.1432 0.1585 0.1555 0.1587
va: 2.1020 2.0373 2.0838 3.7600 3.7236 3.8588 3.9112 3.8859 3.8162 4.1176 3.6982 3.9236 3.9312 3.8207 3.7417 3.9128 3.9567 3.7411 3.8878 4.0124 3.6591 3.8577 3.9627 3.8409 3.8493 3.8435 1.0161 1.0274 1.0028 1.0019 0.9998 1.0013 1.0149 1.0000 1.0068 1.0062 0.9977 0.9979 1.0050 1.0179 1.0047 1.0056 0.9995 1.0032 1.0035 0.9891 1.0065 0.9979 1.0099 0.9918 0.9908 0.9894
dispcorr: -0.030439079 hartree
energy: -1117.896238943360
dipole: -22.34278 22.16527 -0.17751 -0.65569 1.29117 0.63548 2.81955 -1.87937 0.94018
magnitude: 1.14860 au
magnitude: 2.91951 debye
