program: Orca
programVersion: 5.0.2
elementType: O O O C C C C C C C C C C C C C C C C C C C C C C C H H H H H H H H H H H H H H H H H H H H H H H H H H
charge: 0
multiplicity: 1
keywords: wb97x-d3
keywords: def2-TZVPP
keywords: def2/J RIJCOSX
keywords: DEFGRID2
keywords: scfconv7
keywords: smallprint printgap noloewdin
keywords: NOSOSCF
formula: C23H26O3
InChI: InChI=1/C23H26O3/c1-16(2)13-20-21(23(20,3)4)22(24)25-15-17-9-8-12-19(14-17)26-18-10-6-5-7-11-18/h5-14,20-21H,15H2,1-4H3
52 atoms
O  0.16656 -2.751519 -0.406991
O  -0.748012 -1.359196 1.080719
O  3.931772 1.730805 0.778281
C  -3.283193 -3.149351 0.54499
C  -3.408157 -1.863378 -0.212163
C  -2.145577 -2.680936 -0.349747
C  -4.045035 -4.356525 0.055886
C  -3.149149 -3.097554 2.046345
C  -4.294861 -1.712708 -1.393662
C  -0.875007 -2.177498 0.201664
C  -5.528521 -1.201741 -1.365172
C  -6.33641 -1.051195 -2.617755
C  -6.205107 -0.74302 -0.110573
C  1.469978 -2.347029 0.0011
C  1.818165 -0.949878 -0.432989
C  2.656301 -0.188198 0.370072
C  1.357754 -0.42359 -1.635988
C  3.049767 1.079565 -0.034631
C  1.743782 0.851648 -2.02093
C  2.594708 1.61328 -1.233462
C  3.881946 3.091713 0.910994
C  2.68684 3.767363 1.126692
C  5.089209 3.775228 0.891536
C  2.711675 5.14123 1.318365
C  5.09987 5.147693 1.097532
C  3.913753 5.837092 1.305467
H  -3.298391 -0.975952 0.405291
H  -2.040039 -3.240632 -1.27315
H  -4.081498 -4.419444 -1.031545
H  -5.074932 -4.329555 0.418923
H  -3.588691 -5.276904 0.425868
H  -2.715483 -2.16749 2.40668
H  -2.535652 -3.921777 2.417161
H  -4.1361 -3.194722 2.504036
H  -3.893704 -2.035929 -2.350275
H  -5.804579 -1.415505 -3.496938
H  -6.597025 -0.003868 -2.793205
H  -7.281902 -1.595489 -2.545418
H  -5.598969 -0.884558 0.783326
H  -7.143313 -1.284789 0.037564
H  -6.469978 0.316087 -0.173522
H  2.139908 -3.063615 -0.476325
H  1.589672 -2.458291 1.081035
H  3.011159 -0.57886 1.316959
H  0.700482 -0.997815 -2.276491
H  1.385564 1.260349 -2.956968
H  2.89701 2.600662 -1.558543
H  1.745646 3.232215 1.152325
H  6.012378 3.234247 0.724785
H  1.781394 5.66809 1.487877
H  6.042714 5.679289 1.086133
H  3.924985 6.907966 1.460135
elementType: O C H
totalener: -1117.86976003 hartree
nucrepener: 2157.43663586 hartree
electener: -3275.30639589 hartree
oneelecener: -5804.76070613 hartree
twoeener: 2529.45431024 hartree
cpcmener: -0.02566945 hartree
kineticenergy: 1112.80903489 hartree
xcener: -110.227395524088 hartree
chargesum: -0.0000000
charge: -0.294797 -0.465115 -0.328839 0.134566 -0.014755 -0.102730 -0.268341 -0.298110 -0.250634 0.390733 -0.039111 -0.228973 -0.249191 0.105435 0.041993 -0.260901 -0.240083 0.269549 -0.133933 -0.198804 0.268887 -0.183856 -0.239145 -0.148070 -0.126464 -0.180157 0.100543 0.089543 0.090878 0.095581 0.099333 0.094937 0.101695 0.094607 0.118525 0.089034 0.094654 0.092717 0.087207 0.095565 0.099717 0.121463 0.114298 0.129177 0.140804 0.157515 0.154671 0.157889 0.145846 0.159439 0.157102 0.158104
qa: -0.2948 -0.4651 -0.3288 0.1346 -0.0148 -0.1027 -0.2683 -0.2981 -0.2506 0.3907 -0.0391 -0.2290 -0.2492 0.1054 0.0420 -0.2609 -0.2401 0.2695 -0.1339 -0.1988 0.2689 -0.1839 -0.2391 -0.1481 -0.1265 -0.1802 0.1005 0.0895 0.0909 0.0956 0.0993 0.0949 0.1017 0.0946 0.1185 0.0890 0.0947 0.0927 0.0872 0.0956 0.0997 0.1215 0.1143 0.1292 0.1408 0.1575 0.1547 0.1579 0.1458 0.1594 0.1571 0.1581
va: 2.1166 2.0412 2.0703 3.6823 3.7941 3.8612 3.9054 3.8996 3.8623 4.1795 3.7052 3.9286 3.9403 3.7889 3.6365 4.0726 3.9608 3.7464 3.9112 3.9141 3.7019 3.9134 4.0053 3.8935 3.8874 3.8993 1.0235 1.0377 1.0027 1.0018 1.0029 1.0192 0.9993 1.0007 1.0075 1.0076 0.9954 0.9965 1.0084 0.9978 0.9985 0.9906 1.0110 1.0199 1.0137 0.9910 0.9972 0.9966 1.0078 0.9902 0.9894 0.9904
dispcorr: -0.023242168 hartree
energy: -1117.893002194284
dipole: -36.55848 35.81475 -0.74374 -12.26955 11.93620 -0.33335 -3.10991 2.32689 -0.78303
magnitude: 1.13022 au
magnitude: 2.87279 debye
