program: Orca
programVersion: 5.0.2
elementType: O O O C C C C C C C C C C C C C C C C C C C C C C C H H H H H H H H H H H H H H H H H H H H H H H H H H
charge: 0
multiplicity: 1
keywords: wb97x-d3
keywords: def2-TZVPP
keywords: def2/J RIJCOSX
keywords: DEFGRID2
keywords: scfconv7
keywords: smallprint printgap noloewdin
keywords: NOSOSCF
formula: C23H26O3
InChI: InChI=1/C23H26O3/c1-16(2)13-20-21(23(20,3)4)22(24)25-15-17-9-8-12-19(14-17)26-18-10-6-5-7-11-18/h5-14,20-21H,15H2,1-4H3
52 atoms
O  0.17771 -2.759806 -0.396248
O  -0.721096 -1.347887 1.082247
O  3.939541 1.723726 0.773035
C  -3.287117 -3.087138 0.553061
C  -3.380207 -1.814878 -0.230522
C  -2.133613 -2.659973 -0.34262
C  -4.069472 -4.287804 0.080996
C  -3.16236 -3.009658 2.054041
C  -4.256835 -1.667404 -1.421053
C  -0.85763 -2.168976 0.207199
C  -5.513274 -1.216256 -1.390603
C  -6.315803 -1.059489 -2.645652
C  -6.221321 -0.834744 -0.127571
C  1.48504 -2.364047 0.00804
C  1.843065 -0.972614 -0.435812
C  2.668304 -0.201211 0.371369
C  1.402163 -0.46095 -1.652176
C  3.068744 1.061024 -0.043162
C  1.794578 0.809255 -2.047053
C  2.63327 1.580027 -1.255511
C  3.861936 3.081681 0.916941
C  2.650603 3.736939 1.102865
C  5.057975 3.784262 0.938729
C  2.648209 5.109287 1.306057
C  5.040719 5.154792 1.154621
C  3.838385 5.824033 1.333051
H  -3.254974 -0.917255 0.369543
H  -2.03265 -3.239471 -1.2542
H  -4.096372 -4.372242 -1.005125
H  -5.102076 -4.232353 0.432993
H  -3.636407 -5.209704 0.474447
H  -2.560291 -3.832861 2.443704
H  -4.152205 -3.089246 2.507221
H  -2.721521 -2.078007 2.400496
H  -3.82829 -1.936907 -2.382359
H  -5.763014 -1.375302 -3.530594
H  -6.616444 -0.018393 -2.791493
H  -7.239495 -1.642456 -2.598446
H  -6.536551 0.211629 -0.157452
H  -5.614719 -0.975767 0.765806
H  -7.132923 -1.425456 -0.005828
H  2.147995 -3.089179 -0.465692
H  1.605036 -2.469377 1.088352
H  3.00722 -0.579882 1.328862
H  0.755148 -1.043444 -2.29569
H  1.451673 1.206179 -2.993794
H  2.941902 2.563344 -1.587149
H  1.717437 3.187641 1.097472
H  5.993946 3.259095 0.794781
H  1.705194 5.620044 1.452741
H  5.974924 5.700768 1.175023
H  3.827855 6.893569 1.495864
elementType: O C H
totalener: -1117.86958592 hartree
nucrepener: 2160.00472164 hartree
electener: -3277.87430756 hartree
oneelecener: -5809.89457938 hartree
twoeener: 2532.02027183 hartree
cpcmener: -0.02551612 hartree
kineticenergy: 1112.82063750 hartree
xcener: -110.229508473607 hartree
chargesum: 0.0000000
charge: -0.295024 -0.465611 -0.329234 0.120760 -0.018530 -0.090999 -0.271303 -0.297665 -0.245362 0.388438 -0.041967 -0.229400 -0.248621 0.106835 0.041450 -0.258954 -0.239905 0.266394 -0.132904 -0.197579 0.271030 -0.183547 -0.241157 -0.148387 -0.125901 -0.181483 0.102538 0.090213 0.091343 0.096098 0.100126 0.102603 0.094617 0.095274 0.118698 0.089179 0.095072 0.092757 0.101340 0.087188 0.096131 0.121133 0.114141 0.129263 0.140534 0.157495 0.155419 0.157376 0.145834 0.159317 0.157005 0.157930
qa: -0.2950 -0.4656 -0.3292 0.1208 -0.0185 -0.0910 -0.2713 -0.2977 -0.2454 0.3884 -0.0420 -0.2294 -0.2486 0.1068 0.0415 -0.2590 -0.2399 0.2664 -0.1329 -0.1976 0.2710 -0.1835 -0.2412 -0.1484 -0.1259 -0.1815 0.1025 0.0902 0.0913 0.0961 0.1001 0.1026 0.0946 0.0953 0.1187 0.0892 0.0951 0.0928 0.1013 0.0872 0.0961 0.1211 0.1141 0.1293 0.1405 0.1575 0.1554 0.1574 0.1458 0.1593 0.1570 0.1579
va: 2.1163 2.0407 2.0697 3.6862 3.8036 3.8429 3.9062 3.8980 3.8543 4.1836 3.7080 3.9289 3.9375 3.7881 3.6358 4.0725 3.9605 3.7470 3.9089 3.9171 3.7009 3.9092 4.0044 3.8943 3.8876 3.8999 1.0232 1.0366 1.0028 1.0008 1.0030 0.9994 1.0006 1.0194 1.0071 1.0076 0.9953 0.9966 0.9990 1.0083 0.9978 0.9907 1.0110 1.0198 1.0138 0.9909 0.9968 0.9970 1.0079 0.9903 0.9895 0.9905
dispcorr: -0.023393644 hartree
energy: -1117.892979566651
dipole: -36.71581 35.93339 -0.78242 -12.19010 11.83523 -0.35487 -3.10801 2.31861 -0.78939
magnitude: 1.16673 au
magnitude: 2.96559 debye
