program: Orca
programVersion: 5.0.2
elementType: O O O C C C C C C C C C C C C C C C C C C C C C C C H H H H H H H H H H H H H H H H H H H H H H H H H H
charge: 0
multiplicity: 1
keywords: wb97x-d3
keywords: def2-TZVPP
keywords: def2/J RIJCOSX
keywords: DEFGRID2
keywords: scfconv7
keywords: smallprint printgap noloewdin
keywords: NOSOSCF
formula: C23H26O3
InChI: InChI=1/C23H26O3/c1-16(2)13-20-21(23(20,3)4)22(24)25-15-17-9-8-12-19(14-17)26-18-10-6-5-7-11-18/h5-14,20-21H,15H2,1-4H3
52 atoms
O  0.677803 -2.143607 -1.486475
O  0.132385 -3.040017 0.485223
O  2.557568 2.23569 0.398338
C  -2.814229 -2.538996 -0.462491
C  -2.362211 -1.427099 0.424991
C  -1.506206 -1.83455 -0.775241
C  -3.924101 -2.297877 -1.459073
C  -2.823239 -3.94409 0.088435
C  -3.006165 -0.099989 0.470872
C  -0.180356 -2.414253 -0.500728
C  -2.822874 0.826136 1.419721
C  -3.585248 2.116771 1.392626
C  -1.874761 0.68872 2.57222
C  2.06885 -2.374332 -1.228297
C  2.581737 -1.387224 -0.216939
C  2.34666 -0.030216 -0.422854
C  3.245494 -1.808591 0.927151
C  2.740734 0.890813 0.536352
C  3.669394 -0.873827 1.86262
C  3.406907 0.473984 1.683375
C  1.505505 2.754753 -0.303983
C  1.756483 3.914004 -1.025876
C  0.225965 2.211688 -0.263645
C  0.721703 4.532871 -1.711872
C  -0.794702 2.831424 -0.971179
C  -0.555957 3.991297 -1.695999
H  -1.94651 -1.767129 1.367242
H  -1.540334 -1.169599 -1.631071
H  -4.899958 -2.359457 -0.972878
H  -3.898162 -3.05733 -2.242804
H  -3.856947 -1.327065 -1.948877
H  -2.107486 -4.096625 0.892881
H  -2.61122 -4.674115 -0.69554
H  -3.814276 -4.171302 0.486957
H  -3.705267 0.131669 -0.327361
H  -4.17572 2.240291 2.305001
H  -4.26644 2.178668 0.543732
H  -2.908958 2.974545 1.348114
H  -2.418732 0.623847 3.519002
H  -1.238238 1.573961 2.646215
H  -1.219756 -0.178167 2.505411
H  2.552001 -2.236831 -2.195411
H  2.247825 -3.402052 -0.908025
H  1.848628 0.298313 -1.327067
H  3.423119 -2.863668 1.094015
H  4.187609 -1.199454 2.755312
H  3.716067 1.200941 2.424063
H  2.755373 4.332194 -1.043003
H  0.015983 1.315672 0.306701
H  0.922775 5.439833 -2.267496
H  -1.786598 2.398511 -0.949394
H  -1.359637 4.468874 -2.24085
elementType: O C H
totalener: -1117.86836825 hartree
nucrepener: 2350.34138157 hartree
electener: -3468.20974982 hartree
oneelecener: -6190.15454819 hartree
twoeener: 2721.94479838 hartree
cpcmener: -0.02397436 hartree
kineticenergy: 1112.79727033 hartree
xcener: -110.228598671029 hartree
chargesum: -0.0000000
charge: -0.291688 -0.470601 -0.326017 0.114877 0.025052 -0.058358 -0.291118 -0.273556 -0.260688 0.367430 -0.064642 -0.238803 -0.272393 0.096713 0.026746 -0.272197 -0.220162 0.322096 -0.100988 -0.270972 0.316548 -0.260663 -0.202704 -0.113376 -0.143487 -0.201893 0.098271 0.090499 0.103192 0.098058 0.089024 0.092768 0.096926 0.094670 0.117120 0.105207 0.093908 0.090302 0.113379 0.094048 0.091557 0.123707 0.111529 0.142608 0.141254 0.157402 0.145163 0.143700 0.151796 0.157082 0.165965 0.155710
qa: -0.2917 -0.4706 -0.3260 0.1149 0.0251 -0.0584 -0.2911 -0.2736 -0.2607 0.3674 -0.0646 -0.2388 -0.2724 0.0967 0.0267 -0.2722 -0.2202 0.3221 -0.1010 -0.2710 0.3165 -0.2607 -0.2027 -0.1134 -0.1435 -0.2019 0.0983 0.0905 0.1032 0.0981 0.0890 0.0928 0.0969 0.0947 0.1171 0.1052 0.0939 0.0903 0.1134 0.0940 0.0916 0.1237 0.1115 0.1426 0.1413 0.1574 0.1452 0.1437 0.1518 0.1571 0.1660 0.1557
va: 2.1074 2.0345 2.0949 3.7873 3.7559 3.7697 3.9159 3.8889 3.8445 4.1933 3.7110 3.9162 3.9235 3.8132 3.6310 3.9359 3.9611 3.6892 3.8838 4.0154 3.7205 4.0077 3.8911 3.8831 3.8374 3.9588 1.0239 1.0345 0.9994 1.0017 1.0042 1.0202 0.9998 1.0000 1.0105 0.9982 1.0061 0.9958 0.9989 0.9972 1.0110 0.9939 1.0096 1.0131 1.0052 0.9886 1.0080 1.0092 0.9842 0.9883 0.9878 0.9930
dispcorr: -0.028163672 hartree
energy: -1117.896531923632
dipole: -24.68722 24.05139 -0.63583 -3.15979 3.56759 0.40779 3.36855 -4.07652 -0.70797
magnitude: 1.03528 au
magnitude: 2.63147 debye
