program: Orca
programVersion: 5.0.2
elementType: O O O C C C C C C C C C C C C C C C C C C C C C C C H H H H H H H H H H H H H H H H H H H H H H H H H H
charge: 0
multiplicity: 1
keywords: wb97x-d3
keywords: def2-TZVPP
keywords: def2/J RIJCOSX
keywords: DEFGRID2
keywords: scfconv7
keywords: smallprint printgap noloewdin
keywords: NOSOSCF
formula: C23H26O3
InChI: InChI=1/C23H26O3/c1-16(2)13-20-21(23(20,3)4)22(24)25-15-17-9-8-12-19(14-17)26-18-10-6-5-7-11-18/h5-14,20-21H,15H2,1-4H3
52 atoms
O  0.682439 -2.092574 -1.523854
O  0.11527 -2.964873 0.452412
O  2.626005 2.186133 0.520498
C  -2.815119 -2.51022 -0.571345
C  -2.40707 -1.386685 0.325224
C  -1.511875 -1.78401 -0.847584
C  -3.899269 -2.295565 -1.601206
C  -2.814202 -3.91237 -0.012585
C  -3.074866 -0.071577 0.33981
C  -0.188341 -2.355616 -0.546003
C  -3.00623 0.836902 1.32029
C  -3.78064 2.118309 1.236351
C  -2.185883 0.692169 2.566127
C  2.063673 -2.360183 -1.260598
C  2.602425 -1.412089 -0.225402
C  2.373441 -0.047242 -0.37623
C  3.294756 -1.880014 0.882859
C  2.803595 0.835912 0.603016
C  3.753499 -0.982746 1.838259
C  3.499199 0.372646 1.714414
C  1.574615 2.732468 -0.163534
C  0.28497 2.21601 -0.100349
C  1.837465 3.887479 -0.887731
C  -0.734288 2.858409 -0.78867
C  0.80366 4.529931 -1.553407
C  -0.484045 4.014755 -1.515076
H  -2.015852 -1.716176 1.281493
H  -1.530097 -1.123266 -1.70706
H  -3.834469 -1.327881 -2.097212
H  -4.887693 -2.370651 -1.143543
H  -3.8366 -3.060363 -2.377634
H  -3.811627 -4.155873 0.358269
H  -2.119672 -4.046352 0.81292
H  -2.566015 -4.643107 -0.785043
H  -3.688759 0.169439 -0.523035
H  -4.473438 2.209785 2.077745
H  -4.361404 2.193462 0.316937
H  -3.117443 2.985555 1.29059
H  -1.539074 -0.182885 2.571959
H  -2.827148 0.638927 3.450234
H  -1.54989 1.570268 2.703317
H  2.557454 -2.214565 -2.221186
H  2.214523 -3.398887 -0.961967
H  1.851956 0.316393 -1.253247
H  3.465455 -2.942089 1.006962
H  4.293348 -1.344583 2.703755
H  3.836374 1.071046 2.470179
H  0.067525 1.322165 0.471753
H  2.845233 4.282342 -0.922973
H  -1.734363 2.446908 -0.749425
H  1.013066 5.432197 -2.113463
H  -1.287324 4.509653 -2.044789
elementType: O C H
totalener: -1117.86890177 hartree
nucrepener: 2343.74388473 hartree
electener: -3461.61278650 hartree
oneelecener: -6176.99170516 hartree
twoeener: 2715.37891866 hartree
cpcmener: -0.02421779 hartree
kineticenergy: 1112.80774188 hartree
xcener: -110.230904779033 hartree
chargesum: -0.0000000
charge: -0.291914 -0.469219 -0.326156 0.108212 0.034038 -0.063963 -0.288909 -0.273923 -0.263383 0.372490 -0.069892 -0.238143 -0.271287 0.098211 0.030733 -0.272032 -0.224965 0.320404 -0.100116 -0.272187 0.312519 -0.217592 -0.261216 -0.129076 -0.109675 -0.209749 0.099111 0.090246 0.089582 0.102382 0.097800 0.094902 0.092671 0.096847 0.117688 0.105300 0.094049 0.091275 0.093453 0.111337 0.093414 0.123135 0.111729 0.141423 0.141047 0.157171 0.144998 0.160190 0.143840 0.171347 0.156938 0.154914
qa: -0.2919 -0.4692 -0.3262 0.1082 0.0340 -0.0640 -0.2889 -0.2739 -0.2634 0.3725 -0.0699 -0.2381 -0.2713 0.0982 0.0307 -0.2720 -0.2250 0.3204 -0.1001 -0.2722 0.3125 -0.2176 -0.2612 -0.1291 -0.1097 -0.2097 0.0991 0.0902 0.0896 0.1024 0.0978 0.0949 0.0927 0.0968 0.1177 0.1053 0.0940 0.0913 0.0935 0.1113 0.0934 0.1231 0.1117 0.1414 0.1410 0.1572 0.1450 0.1602 0.1438 0.1713 0.1569 0.1549
va: 2.1075 2.0372 2.0935 3.7773 3.7534 3.7680 3.9148 3.8934 3.8456 4.1902 3.7225 3.9129 3.9264 3.8101 3.6308 3.9342 3.9635 3.6958 3.8831 4.0139 3.7229 3.9143 4.0134 3.8203 3.8785 3.9697 1.0235 1.0346 1.0052 0.9998 1.0016 0.9998 1.0204 0.9999 1.0108 0.9982 1.0059 0.9961 1.0106 0.9991 0.9968 0.9935 1.0094 1.0143 1.0047 0.9886 1.0081 0.9829 1.0089 0.9846 0.9884 0.9941
dispcorr: -0.027798452 hartree
energy: -1117.896700225934
dipole: -25.54920 24.87267 -0.67653 -3.20247 3.56606 0.36359 2.56104 -3.32548 -0.76444
magnitude: 1.08363 au
magnitude: 2.75438 debye
