program: Orca
programVersion: 5.0.2
elementType: O O O C C C C C C C C C C C C C C C C C C C C C C C H H H H H H H H H H H H H H H H H H H H H H H H H H
charge: 0
multiplicity: 1
keywords: wb97x-d3
keywords: def2-TZVPP
keywords: def2/J RIJCOSX
keywords: DEFGRID2
keywords: scfconv7
keywords: smallprint printgap noloewdin
keywords: NOSOSCF
formula: C23H26O3
InChI: InChI=1/C23H26O3/c1-16(2)13-20-21(23(20,3)4)22(24)25-15-17-9-8-12-19(14-17)26-18-10-6-5-7-11-18/h5-14,20-21H,15H2,1-4H3
52 atoms
O  0.317036 -2.010392 -0.727843
O  -0.54954 -3.911151 -1.502295
O  3.089897 2.128001 0.18016
C  -2.147922 -1.785095 1.034819
C  -2.353868 -0.95905 -0.199859
C  -1.964091 -2.423692 -0.330973
C  -3.349548 -2.259236 1.818564
C  -0.97175 -1.467784 1.927369
C  -3.693813 -0.541882 -0.658008
C  -0.679728 -2.86634 -0.906771
C  -4.063885 0.682135 -1.048663
C  -5.474641 0.952307 -1.479594
C  -3.163139 1.878337 -1.08996
C  1.617527 -2.35134 -1.214123
C  2.598734 -1.433222 -0.546731
C  2.361412 -0.06219 -0.509027
C  3.752255 -1.948534 0.031236
C  3.263577 0.773857 0.132054
C  4.663659 -1.097211 0.641265
C  4.420505 0.26458 0.707375
C  1.846275 2.660943 0.382818
C  1.543314 3.826567 -0.306303
C  0.93718 2.113027 1.281244
C  0.324061 4.452332 -0.089654
C  -0.28351 2.742873 1.477256
C  -0.596196 3.913053 0.79787
H  -1.5505 -0.258609 -0.399397
H  -2.77004 -3.08895 -0.621354
H  -4.171324 -2.592243 1.185688
H  -3.726924 -1.459489 2.45968
H  -3.07557 -3.096562 2.463615
H  -0.572583 -2.370807 2.394184
H  -1.301478 -0.806552 2.731559
H  -0.156946 -0.965403 1.412535
H  -4.451444 -1.320383 -0.671359
H  -5.508127 1.319625 -2.509034
H  -5.932483 1.729373 -0.861262
H  -6.103179 0.063677 -1.419934
H  -2.128877 1.662124 -0.830187
H  -3.521721 2.649188 -0.402475
H  -3.168121 2.330026 -2.085395
H  1.639309 -2.231261 -2.300973
H  1.856575 -3.391526 -0.987609
H  1.474781 0.350576 -0.975589
H  3.937627 -3.015235 0.010904
H  5.562107 -1.500468 1.089785
H  5.118559 0.929951 1.199648
H  2.261719 4.243488 -1.000745
H  1.17312 1.210456 1.831107
H  0.093256 5.36439 -0.624572
H  -0.992422 2.315103 2.174731
H  -1.548447 4.400329 0.960566
elementType: O C H
totalener: -1117.86785012 hartree
nucrepener: 2310.69730887 hartree
electener: -3428.56515899 hartree
oneelecener: -6110.00113552 hartree
twoeener: 2681.43597653 hartree
cpcmener: -0.02603204 hartree
kineticenergy: 1112.80994938 hartree
xcener: -110.229670343344 hartree
chargesum: -0.0000000
charge: -0.268317 -0.475029 -0.330044 0.128685 0.088345 -0.121298 -0.269907 -0.269718 -0.296383 0.405287 -0.044520 -0.220307 -0.241759 0.084963 0.010622 -0.229902 -0.213746 0.281707 -0.114092 -0.249501 0.298317 -0.254084 -0.203189 -0.100403 -0.143835 -0.217456 0.089645 0.084796 0.087759 0.095908 0.097656 0.105613 0.095210 0.056105 0.115593 0.093430 0.092434 0.088240 0.069784 0.097723 0.097502 0.121445 0.098338 0.145015 0.143623 0.156986 0.146297 0.144757 0.164019 0.157438 0.159186 0.161063
qa: -0.2683 -0.4750 -0.3300 0.1287 0.0883 -0.1213 -0.2699 -0.2697 -0.2964 0.4053 -0.0445 -0.2203 -0.2418 0.0850 0.0106 -0.2299 -0.2137 0.2817 -0.1141 -0.2495 0.2983 -0.2541 -0.2032 -0.1004 -0.1438 -0.2175 0.0896 0.0848 0.0878 0.0959 0.0977 0.1056 0.0952 0.0561 0.1156 0.0934 0.0924 0.0882 0.0698 0.0977 0.0975 0.1214 0.0983 0.1450 0.1436 0.1570 0.1463 0.1448 0.1640 0.1574 0.1592 0.1611
va: 2.1200 2.0333 2.0808 3.6464 3.7279 3.8885 3.9169 3.9304 3.8590 4.1684 3.7763 3.9216 3.9457 3.8221 3.7157 3.8921 3.9541 3.7132 3.8967 4.0182 3.6888 4.0193 3.8818 3.8638 3.8170 3.8818 1.0081 1.0356 1.0073 1.0017 1.0015 1.0041 0.9996 1.0091 1.0120 0.9964 0.9959 1.0089 1.0070 0.9962 0.9993 0.9915 1.0131 1.0150 1.0011 0.9894 1.0065 1.0085 0.9888 0.9883 0.9921 0.9889
dispcorr: -0.027306655 hartree
energy: -1117.895156773902
dipole: -25.88328 25.54358 -0.33970 2.07881 -1.03012 1.04869 4.37144 -3.60858 0.76286
magnitude: 1.34056 au
magnitude: 3.40742 debye
