program: Orca
programVersion: 5.0.2
elementType: O O O C C C C C C C C C C C C C C C C C C C C C C C H H H H H H H H H H H H H H H H H H H H H H H H H H
charge: 0
multiplicity: 1
keywords: wb97x-d3
keywords: def2-TZVPP
keywords: def2/J RIJCOSX
keywords: DEFGRID2
keywords: scfconv7
keywords: smallprint printgap noloewdin
keywords: NOSOSCF
formula: C23H26O3
InChI: InChI=1/C23H26O3/c1-16(2)13-20-21(23(20,3)4)22(24)25-15-17-9-8-12-19(14-17)26-18-10-6-5-7-11-18/h5-14,20-21H,15H2,1-4H3
52 atoms
O  -0.303712 -1.391711 -1.788272
O  -1.233642 0.127155 -0.440828
O  3.389149 1.952932 1.348333
C  -2.558866 -2.511927 0.704852
C  -3.565883 -1.701591 -0.055854
C  -2.245685 -2.029247 -0.704679
C  -2.78684 -3.995021 0.856807
C  -1.878083 -1.889612 1.897981
C  -4.807747 -2.303485 -0.601854
C  -1.242458 -0.973557 -0.938119
C  -6.014784 -2.21404 -0.036949
C  -7.218949 -2.838779 -0.672485
C  -6.275186 -1.496647 1.251841
C  0.801681 -0.518299 -2.032941
C  1.747886 -0.471451 -0.865751
C  2.112454 0.749737 -0.314069
C  2.271828 -1.651638 -0.344159
C  3.024687 0.788812 0.734587
C  3.161124 -1.600939 0.717171
C  3.551406 -0.383441 1.255953
C  3.533759 3.110721 0.635641
C  4.149424 3.146345 -0.610098
C  3.09693 4.280068 1.242655
C  4.313037 4.366706 -1.249358
C  3.278895 5.494294 0.596857
C  3.880275 5.543812 -0.653149
H  -3.654827 -0.673797 0.284563
H  -2.258557 -2.80813 -1.460236
H  -3.472524 -4.192317 1.683926
H  -1.848828 -4.509224 1.076064
H  -3.211787 -4.450189 -0.037546
H  -2.431732 -2.140785 2.805233
H  -1.822633 -0.804382 1.844728
H  -0.862219 -2.272591 2.019062
H  -4.715021 -2.857393 -1.531946
H  -7.988567 -2.089607 -0.878023
H  -7.677166 -3.575294 -0.006974
H  -6.978462 -3.337445 -1.611584
H  -6.949455 -0.649481 1.098793
H  -5.370475 -1.121573 1.727796
H  -6.772882 -2.158742 1.965241
H  0.456984 0.481123 -2.304252
H  1.296823 -0.945314 -2.905255
H  1.680278 1.663334 -0.704852
H  1.992676 -2.608619 -0.767557
H  3.569825 -2.516968 1.123662
H  4.254169 -0.341905 2.078702
H  4.504035 2.237765 -1.080535
H  2.624712 4.237267 2.216238
H  4.790392 4.394168 -2.220473
H  2.940387 6.40473 1.074593
H  4.015004 6.491911 -1.156868
elementType: O C H
totalener: -1117.86977027 hartree
nucrepener: 2184.63791449 hartree
electener: -3302.50768475 hartree
oneelecener: -5859.20559116 hartree
twoeener: 2556.69790640 hartree
cpcmener: -0.02546758 hartree
kineticenergy: 1112.80890958 hartree
xcener: -110.226504099406 hartree
chargesum: 0.0000000
charge: -0.286864 -0.465103 -0.328397 0.143020 -0.008845 -0.123733 -0.267543 -0.292948 -0.258983 0.394537 -0.035170 -0.228514 -0.250899 0.092904 0.024620 -0.187351 -0.262491 0.278468 -0.106183 -0.256460 0.289252 -0.197110 -0.251119 -0.142728 -0.119624 -0.188325 0.097832 0.090863 0.095607 0.098283 0.090436 0.096669 0.094774 0.098209 0.119293 0.093765 0.093630 0.088765 0.100344 0.087930 0.094159 0.113017 0.124320 0.139409 0.140639 0.156058 0.146183 0.155770 0.145526 0.158809 0.157409 0.157890
qa: -0.2869 -0.4651 -0.3284 0.1430 -0.0088 -0.1237 -0.2675 -0.2929 -0.2590 0.3945 -0.0352 -0.2285 -0.2509 0.0929 0.0246 -0.1874 -0.2625 0.2785 -0.1062 -0.2565 0.2893 -0.1971 -0.2511 -0.1427 -0.1196 -0.1883 0.0978 0.0909 0.0956 0.0983 0.0904 0.0967 0.0948 0.0982 0.1193 0.0938 0.0936 0.0888 0.1003 0.0879 0.0942 0.1130 0.1243 0.1394 0.1406 0.1561 0.1462 0.1558 0.1455 0.1588 0.1574 0.1579
va: 2.1193 2.0460 2.0784 3.6741 3.7926 3.8662 3.9042 3.9000 3.8661 4.2115 3.7055 3.9280 3.9410 3.8041 3.6225 3.9199 3.9621 3.7225 3.8870 4.0194 3.6943 3.9136 4.0110 3.8910 3.8829 3.9073 1.0252 1.0374 1.0025 1.0031 1.0027 1.0014 1.0179 1.0009 1.0075 0.9952 0.9966 1.0078 0.9977 1.0079 0.9981 1.0105 0.9917 1.0122 1.0108 0.9892 1.0068 0.9975 1.0086 0.9903 0.9893 0.9906
dispcorr: -0.023837735 hartree
energy: -1117.893608002021
dipole: -31.72658 31.57921 -0.14737 -17.25873 16.37335 -0.88538 4.04721 -4.63687 -0.58966
magnitude: 1.07393 au
magnitude: 2.72971 debye
