program: Orca
programVersion: 5.0.2
elementType: O O O C C C C C C C C C C C C C C C C C C C C C C C H H H H H H H H H H H H H H H H H H H H H H H H H H
charge: 0
multiplicity: 1
keywords: wb97x-d3
keywords: def2-TZVPP
keywords: def2/J RIJCOSX
keywords: DEFGRID2
keywords: scfconv7
keywords: smallprint printgap noloewdin
keywords: NOSOSCF
formula: C23H26O3
InChI: InChI=1/C23H26O3/c1-16(2)13-20-21(23(20,3)4)22(24)25-15-17-9-8-12-19(14-17)26-18-10-6-5-7-11-18/h5-14,20-21H,15H2,1-4H3
52 atoms
O  -0.09392 -2.520104 -1.198713
O  -0.49007 -2.345715 0.992207
O  3.201306 1.912968 1.078911
C  -3.05558 -4.042586 0.320835
C  -3.40438 -2.596623 0.362921
C  -2.229959 -3.058863 -0.493207
C  -3.904095 -4.984875 -0.49862
C  -2.481383 -4.692923 1.555372
C  -4.608796 -2.020454 -0.28395
C  -0.877195 -2.61961 -0.11907
C  -4.756825 -0.72738 -0.586976
C  -6.015634 -0.209279 -1.21205
C  -3.698113 0.304309 -0.343472
C  1.201148 -1.957377 -1.016623
C  1.153473 -0.484244 -0.711484
C  2.182792 0.080812 0.03075
C  0.134053 0.328947 -1.196494
C  2.184803 1.44222 0.297734
C  0.137539 1.685749 -0.906477
C  1.154447 2.255733 -0.156214
C  3.734776 3.151054 0.848761
C  3.979817 3.627902 -0.433928
C  4.086672 3.902096 1.961533
C  4.573657 4.871736 -0.591548
C  4.692577 5.138372 1.788238
C  4.932295 5.632446 0.513523
H  -3.0867 -2.092296 1.271776
H  -2.409198 -3.092511 -1.561804
H  -4.77644 -5.313042 0.070699
H  -3.333018 -5.875986 -0.766579
H  -4.261295 -4.53583 -1.425425
H  -1.79253 -5.497909 1.290881
H  -3.288608 -5.133428 2.144365
H  -1.952405 -3.996062 2.201174
H  -5.427135 -2.699603 -0.505122
H  -5.807597 0.271272 -2.171855
H  -6.482524 0.552586 -0.581924
H  -6.74785 -0.998717 -1.382312
H  -2.785956 -0.101859 0.090277
H  -4.066002 1.086059 0.326719
H  -3.431252 0.805171 -1.278101
H  1.712676 -2.129977 -1.964649
H  1.756088 -2.494544 -0.244326
H  2.984578 -0.539306 0.415894
H  -0.669916 -0.083902 -1.792165
H  -0.666774 2.313315 -1.268363
H  1.134428 3.313658 0.072179
H  3.717351 3.04006 -1.304637
H  3.894336 3.515765 2.954807
H  4.760253 5.244451 -1.590622
H  4.971035 5.719419 2.658034
H  5.396931 6.600678 0.381436
elementType: O C H
totalener: -1117.86874570 hartree
nucrepener: 2194.53498559 hartree
electener: -3312.40373129 hartree
oneelecener: -5878.78606899 hartree
twoeener: 2566.38233770 hartree
cpcmener: -0.02560354 hartree
kineticenergy: 1112.80639852 hartree
xcener: -110.228576912896 hartree
chargesum: -0.0000000
charge: -0.295253 -0.466007 -0.328559 0.160359 -0.034325 -0.066858 -0.291967 -0.275211 -0.285507 0.354393 0.003319 -0.230057 -0.263846 0.103110 0.061420 -0.272831 -0.270193 0.279356 -0.121736 -0.208094 0.282857 -0.189613 -0.247782 -0.148870 -0.123500 -0.184858 0.103222 0.090155 0.101369 0.098021 0.089858 0.098182 0.094012 0.093457 0.122603 0.094423 0.095146 0.088953 0.078640 0.103585 0.098093 0.121027 0.113672 0.129906 0.154489 0.157918 0.155767 0.156922 0.145924 0.159285 0.157672 0.157952
qa: -0.2953 -0.4660 -0.3286 0.1604 -0.0343 -0.0669 -0.2920 -0.2752 -0.2855 0.3544 0.0033 -0.2301 -0.2638 0.1031 0.0614 -0.2728 -0.2702 0.2794 -0.1217 -0.2081 0.2829 -0.1896 -0.2478 -0.1489 -0.1235 -0.1849 0.1032 0.0902 0.1014 0.0980 0.0899 0.0982 0.0940 0.0935 0.1226 0.0944 0.0951 0.0890 0.0786 0.1036 0.0981 0.1210 0.1137 0.1299 0.1545 0.1579 0.1558 0.1569 0.1459 0.1593 0.1577 0.1580
va: 2.1093 2.0332 2.0734 3.7226 3.8237 3.7837 3.9143 3.8813 3.8910 4.1684 3.6988 3.9286 3.9507 3.7936 3.6319 4.0937 3.9481 3.7295 3.8904 3.9397 3.6925 3.9043 4.0042 3.8944 3.8869 3.9032 1.0240 1.0341 0.9986 1.0028 1.0013 0.9995 1.0010 1.0194 1.0043 0.9964 0.9958 1.0068 1.0101 1.0004 0.9956 0.9912 1.0118 1.0195 1.0023 0.9923 0.9965 0.9970 1.0081 0.9903 0.9892 0.9905
dispcorr: -0.024719771 hartree
energy: -1117.893465475196
dipole: -28.74821 28.18692 -0.56129 -11.48083 11.80437 0.32353 -3.66787 2.37784 -1.29003
magnitude: 1.44357 au
magnitude: 3.66927 debye
