program: Orca
programVersion: 5.0.2
elementType: O O O C C C C C C C C C C C C C C C C C C C C C C C H H H H H H H H H H H H H H H H H H H H H H H H H H
charge: 0
multiplicity: 1
keywords: wb97x-d3
keywords: def2-TZVPP
keywords: def2/J RIJCOSX
keywords: DEFGRID2
keywords: scfconv7
keywords: smallprint printgap noloewdin
keywords: NOSOSCF
formula: C23H26O3
InChI: InChI=1/C23H26O3/c1-16(2)13-20-21(23(20,3)4)22(24)25-15-17-9-8-12-19(14-17)26-18-10-6-5-7-11-18/h5-14,20-21H,15H2,1-4H3
52 atoms
O  0.0257 -2.654131 -1.100994
O  -0.436075 -2.227015 1.040611
O  2.976112 1.933864 1.186215
C  -3.027306 -3.908204 0.498762
C  -3.338552 -2.464334 0.316833
C  -2.143419 -3.071808 -0.411899
C  -3.866735 -4.943117 -0.211778
C  -2.525153 -4.383035 1.840482
C  -4.501577 -1.968014 -0.458669
C  -0.793631 -2.617264 -0.045589
C  -4.62206 -0.724312 -0.932676
C  -5.845089 -0.292363 -1.682787
C  -3.568713 0.328748 -0.768095
C  1.324223 -2.086099 -0.938312
C  1.272514 -0.59169 -0.773339
C  2.143926 0.02918 0.110539
C  0.387103 0.180328 -1.520806
C  2.127227 1.410395 0.253791
C  0.368488 1.556985 -1.357812
C  1.232591 2.185745 -0.47255
C  3.519505 3.177844 1.015681
C  4.059207 3.587488 -0.198017
C  3.573638 4.003818 2.129468
C  4.645489 4.841609 -0.289123
C  4.173658 5.250997 2.026397
C  4.704514 5.678783 0.817493
H  -3.045517 -1.838632 1.155871
H  -2.28302 -3.253181 -1.471455
H  -4.772731 -5.164363 0.356805
H  -3.309216 -5.875976 -0.316239
H  -4.168879 -4.631392 -1.211743
H  -3.369858 -4.722954 2.443987
H  -2.01363 -3.608798 2.407552
H  -1.842347 -5.227964 1.729117
H  -5.314983 -2.66639 -0.633692
H  -6.331931 0.553491 -1.189505
H  -6.577956 -1.094366 -1.773435
H  -5.588852 0.04594 -2.690472
H  -3.25309 0.711704 -1.742675
H  -2.680093 -0.022968 -0.245847
H  -3.961937 1.187282 -0.216022
H  1.854822 -2.350617 -1.85401
H  1.853901 -2.553411 -0.105351
H  2.833678 -0.560497 0.703705
H  -0.294046 -0.283829 -2.222803
H  -0.330963 2.155541 -1.927289
H  1.194683 3.260626 -0.35051
H  4.029955 2.938868 -1.064769
H  3.15367 3.669377 3.069986
H  5.063556 5.161818 -1.2349
H  4.216489 5.892565 2.897199
H  5.164969 6.654783 0.7386
elementType: O C H
totalener: -1117.86876545 hartree
nucrepener: 2199.70239608 hartree
electener: -3317.57116153 hartree
oneelecener: -5889.26176699 hartree
twoeener: 2571.69060546 hartree
cpcmener: -0.02544056 hartree
kineticenergy: 1112.79781394 hartree
xcener: -110.226132637884 hartree
chargesum: -0.0000000
charge: -0.293151 -0.467992 -0.327566 0.158019 -0.036377 -0.064002 -0.292378 -0.277108 -0.281021 0.356826 -0.000758 -0.229667 -0.258095 0.105306 0.065498 -0.268494 -0.277692 0.282156 -0.125495 -0.203614 0.278547 -0.191063 -0.241797 -0.145807 -0.124756 -0.181762 0.102844 0.088613 0.101096 0.097900 0.089113 0.093774 0.093627 0.098841 0.123189 0.094237 0.089003 0.094561 0.096275 0.078155 0.102974 0.120087 0.112988 0.129415 0.145883 0.158357 0.155395 0.156343 0.145778 0.158603 0.157300 0.157892
qa: -0.2932 -0.4680 -0.3276 0.1580 -0.0364 -0.0640 -0.2924 -0.2771 -0.2810 0.3568 -0.0008 -0.2297 -0.2581 0.1053 0.0655 -0.2685 -0.2777 0.2822 -0.1255 -0.2036 0.2785 -0.1911 -0.2418 -0.1458 -0.1248 -0.1818 0.1028 0.0886 0.1011 0.0979 0.0891 0.0938 0.0936 0.0988 0.1232 0.0942 0.0890 0.0946 0.0963 0.0782 0.1030 0.1201 0.1130 0.1294 0.1459 0.1584 0.1554 0.1563 0.1458 0.1586 0.1573 0.1579
va: 2.1093 2.0337 2.0746 3.7245 3.8309 3.7854 3.9155 3.8795 3.8895 4.1739 3.7059 3.9288 3.9498 3.7911 3.6167 4.0788 3.9439 3.7313 3.8842 3.9289 3.6948 3.9135 4.0051 3.8920 3.8851 3.9017 1.0226 1.0344 0.9985 1.0027 1.0017 1.0007 1.0201 0.9994 1.0036 0.9959 1.0068 0.9961 0.9969 1.0104 0.9997 0.9913 1.0108 1.0200 1.0096 0.9912 0.9970 0.9971 1.0080 0.9905 0.9894 0.9905
dispcorr: -0.024618497 hartree
energy: -1117.893383946769
dipole: -28.07795 27.63121 -0.44673 -11.18313 11.46085 0.27773 -4.47890 3.16284 -1.31606
magnitude: 1.41729 au
magnitude: 3.60247 debye
