program: Orca
programVersion: 5.0.2
elementType: O O O C C C C C C C C C C C C C C C C C C C C C C C H H H H H H H H H H H H H H H H H H H H H H H H H H
charge: 0
multiplicity: 1
keywords: wb97x-d3
keywords: def2-TZVPP
keywords: def2/J RIJCOSX
keywords: DEFGRID2
keywords: scfconv7
keywords: smallprint printgap noloewdin
keywords: NOSOSCF
formula: C23H26O3
InChI: InChI=1/C23H26O3/c1-16(2)13-20-21(23(20,3)4)22(24)25-15-17-9-8-12-19(14-17)26-18-10-6-5-7-11-18/h5-14,20-21H,15H2,1-4H3
52 atoms
O  0.634396 -2.097872 -1.459318
O  0.174685 -2.718361 0.636343
O  2.798851 2.181942 0.422382
C  -2.793752 -2.615001 -0.359747
C  -2.471572 -1.340439 0.356029
C  -1.556806 -1.830554 -0.760211
C  -3.8990 -2.649003 -1.388643
C  -2.676888 -3.912803 0.403264
C  -3.244169 -0.098449 0.175419
C  -0.191706 -2.271209 -0.424391
C  -3.416054 0.875539 1.076979
C  -4.273301 2.064282 0.75804
C  -2.808957 0.901361 2.446365
C  2.019422 -2.384361 -1.250827
C  2.661618 -1.41943 -0.292748
C  2.414885 -0.055441 -0.419643
C  3.503134 -1.881474 0.710079
C  2.98182 0.832073 0.484228
C  4.094597 -0.980028 1.584506
C  3.829739 0.37527 1.486939
C  1.68168 2.732894 -0.143134
C  1.874795 3.85082 -0.942833
C  0.400076 2.258096 0.113021
C  0.777794 4.500831 -1.489689
C  -0.685413 2.908141 -0.455632
C  -0.505867 4.029967 -1.25371
H  -2.056456 -1.494072 1.346041
H  -1.639407 -1.306586 -1.705923
H  -4.873589 -2.742635 -0.905043
H  -3.773565 -3.511672 -2.046059
H  -3.925893 -1.763753 -2.022873
H  -2.370795 -4.730325 -0.25292
H  -3.651794 -4.175999 0.818981
H  -1.974162 -3.864809 1.231561
H  -3.728274 0.026936 -0.788488
H  -5.115919 2.136288 1.45172
H  -4.676447 2.02345 -0.253931
H  -3.713056 2.99763 0.862091
H  -2.253405 1.830819 2.596843
H  -2.127543 0.077048 2.647095
H  -3.585985 0.883306 3.215514
H  2.465168 -2.299825 -2.2424
H  2.155654 -3.414195 -0.913837
H  1.777239 0.305417 -1.21747
H  3.688914 -2.943091 0.815876
H  4.751363 -1.337846 2.366866
H  4.272834 1.078074 2.181415
H  2.878758 4.21176 -1.128728
H  0.239069 1.392884 0.74494
H  0.932503 5.3747 -2.109348
H  -1.681197 2.529172 -0.26739
H  -1.360911 4.531426 -1.687652
elementType: O C H
totalener: -1117.86945728 hartree
nucrepener: 2323.02496220 hartree
electener: -3440.89441948 hartree
oneelecener: -6135.63313221 hartree
twoeener: 2694.73871273 hartree
cpcmener: -0.02502115 hartree
kineticenergy: 1112.80236414 hartree
xcener: -110.229941498142 hartree
chargesum: 0.0000000
charge: -0.293095 -0.467866 -0.326488 0.095799 0.040403 -0.072478 -0.279465 -0.274552 -0.269934 0.382821 -0.070084 -0.222018 -0.260758 0.101414 0.036145 -0.272563 -0.230912 0.321236 -0.100312 -0.274546 0.338316 -0.272412 -0.282076 -0.087901 -0.056243 -0.251211 0.099013 0.088532 0.099574 0.096795 0.090003 0.097538 0.095260 0.092541 0.114189 0.105855 0.092822 0.084949 0.091493 0.094165 0.106737 0.122088 0.113173 0.140628 0.139915 0.156637 0.144884 0.144627 0.160947 0.156754 0.167422 0.152241
qa: -0.2931 -0.4679 -0.3265 0.0958 0.0404 -0.0725 -0.2795 -0.2746 -0.2699 0.3828 -0.0701 -0.2220 -0.2608 0.1014 0.0361 -0.2726 -0.2309 0.3212 -0.1003 -0.2745 0.3383 -0.2724 -0.2821 -0.0879 -0.0562 -0.2512 0.0990 0.0885 0.0996 0.0968 0.0900 0.0975 0.0953 0.0925 0.1142 0.1059 0.0928 0.0849 0.0915 0.0942 0.1067 0.1221 0.1132 0.1406 0.1399 0.1566 0.1449 0.1446 0.1609 0.1568 0.1674 0.1522
va: 2.1111 2.0388 2.0922 3.7451 3.7545 3.7783 3.9141 3.8993 3.8643 4.1790 3.7830 3.8998 3.9320 3.8007 3.6340 3.9323 3.9700 3.7008 3.8866 4.0125 3.6805 4.0289 3.9771 3.8562 3.7516 3.9991 1.0244 1.0352 1.0005 1.0016 1.0069 0.9999 0.9996 1.0206 1.0130 0.9959 1.0077 0.9983 0.9972 1.0101 0.9988 0.9922 1.0085 1.0168 1.0042 0.9889 1.0083 1.0089 0.9958 0.9888 0.9781 0.9972
dispcorr: -0.026885620 hartree
energy: -1117.896342901527
dipole: -27.52867 26.70975 -0.81892 -3.99189 4.13922 0.14733 2.46984 -3.31537 -0.84553
magnitude: 1.18628 au
magnitude: 3.01528 debye
