program: Orca
programVersion: 5.0.2
elementType: O O O C C C C C C C C C C C C C C C C C C C C C C C H H H H H H H H H H H H H H H H H H H H H H H H H H
charge: 0
multiplicity: 1
keywords: wb97x-d3
keywords: def2-TZVPP
keywords: def2/J RIJCOSX
keywords: DEFGRID2
keywords: scfconv7
keywords: smallprint printgap noloewdin
keywords: NOSOSCF
formula: C23H26O3
InChI: InChI=1/C23H26O3/c1-16(2)13-20-21(23(20,3)4)22(24)25-15-17-9-8-12-19(14-17)26-18-10-6-5-7-11-18/h5-14,20-21H,15H2,1-4H3
52 atoms
O  -0.629751 -0.938083 -1.766258
O  -1.498657 0.12505 -0.00487
O  3.5788 2.04502 1.304462
C  -2.610541 -2.784629 0.51202
C  -3.715126 -1.873875 0.06508
C  -2.447715 -1.944915 -0.747148
C  -2.761223 -4.269342 0.294702
C  -1.84775 -2.440436 1.767099
C  -4.976899 -2.396319 -0.515763
C  -1.511113 -0.807563 -0.771675
C  -6.137156 -2.500546 0.138144
C  -7.365775 -3.029227 -0.537568
C  -6.319883 -2.113003 1.573405
C  0.405474 0.038078 -1.85581
C  1.420732 -0.092981 -0.753687
C  2.008011 1.054271 -0.236865
C  1.808517 -1.342395 -0.276727
C  2.997223 0.948323 0.7338
C  2.77485 -1.431988 0.713256
C  3.383314 -0.292457 1.21789
C  3.91142 3.13365 0.547098
C  4.420509 3.02111 -0.741731
C  3.779369 4.37836 1.147776
C  4.78408 4.170395 -1.429234
C  4.158707 5.517307 0.452211
C  4.656388 5.420976 -0.840054
H  -3.812915 -0.971687 0.661986
H  -2.497009 -2.506782 -1.674197
H  -3.356744 -4.713394 1.095666
H  -1.785767 -4.759974 0.297826
H  -3.249082 -4.510046 -0.649508
H  -1.845675 -1.375797 1.990967
H  -0.809296 -2.773584 1.703944
H  -2.301787 -2.948914 2.620313
H  -4.94142 -2.717685 -1.55309
H  -7.744223 -3.91744 -0.024364
H  -7.182523 -3.295143 -1.578809
H  -8.174414 -2.293497 -0.515699
H  -7.063135 -1.316865 1.670749
H  -5.402414 -1.773342 2.051504
H  -6.699705 -2.958775 2.15283
H  -0.0111 1.047198 -1.8848
H  0.874943 -0.149301 -2.822523
H  1.686899 2.0272 -0.590911
H  1.360751 -2.247031 -0.667989
H  3.070415 -2.402831 1.089431
H  4.145082 -0.362441 1.984169
H  4.539366 2.052509 -1.210881
H  3.386399 4.451726 2.154242
H  5.177466 4.081321 -2.43378
H  4.056055 6.485771 0.924844
H  4.945197 6.311701 -1.382339
elementType: O C H
totalener: -1117.86985509 hartree
nucrepener: 2173.28148467 hartree
electener: -3291.15133976 hartree
oneelecener: -5836.31440319 hartree
twoeener: 2545.16306343 hartree
cpcmener: -0.02609575 hartree
kineticenergy: 1112.80568169 hartree
xcener: -110.227354998719 hartree
chargesum: -0.0000000
charge: -0.291649 -0.460215 -0.328508 0.151073 -0.013845 -0.108748 -0.268244 -0.295309 -0.264118 0.379205 -0.032303 -0.228617 -0.250297 0.099051 0.057184 -0.214413 -0.272891 0.276176 -0.102595 -0.254974 0.291009 -0.194231 -0.253351 -0.145930 -0.118626 -0.189999 0.099634 0.090278 0.096189 0.097910 0.090558 0.097057 0.094894 0.098050 0.119557 0.093553 0.088495 0.094211 0.098565 0.087357 0.095007 0.114631 0.120947 0.140889 0.141161 0.156437 0.146076 0.154344 0.145347 0.158914 0.157413 0.157694
qa: -0.2916 -0.4602 -0.3285 0.1511 -0.0138 -0.1087 -0.2682 -0.2953 -0.2641 0.3792 -0.0323 -0.2286 -0.2503 0.0991 0.0572 -0.2144 -0.2729 0.2762 -0.1026 -0.2550 0.2910 -0.1942 -0.2534 -0.1459 -0.1186 -0.1900 0.0996 0.0903 0.0962 0.0979 0.0906 0.0971 0.0949 0.0981 0.1196 0.0936 0.0885 0.0942 0.0986 0.0874 0.0950 0.1146 0.1209 0.1409 0.1412 0.1564 0.1461 0.1543 0.1453 0.1589 0.1574 0.1577
va: 2.1152 2.0461 2.0769 3.6630 3.8012 3.8589 3.9054 3.8958 3.8702 4.2146 3.7057 3.9277 3.9421 3.7994 3.5912 3.9691 3.9494 3.7161 3.8835 4.0244 3.6959 3.9046 4.0065 3.8946 3.8836 3.9080 1.0247 1.0378 1.0026 1.0030 1.0025 1.0173 1.0023 1.0021 1.0077 0.9963 1.0078 0.9953 0.9980 1.0084 0.9977 1.0117 0.9913 1.0077 1.0135 0.9892 1.0065 0.9982 1.0087 0.9904 0.9892 0.9907
dispcorr: -0.023996699 hartree
energy: -1117.893851785767
dipole: -31.47067 31.28667 -0.18400 -20.35185 19.48644 -0.86540 3.09076 -3.94199 -0.85123
magnitude: 1.22775 au
magnitude: 3.12070 debye
