program: Orca
programVersion: 5.0.2
elementType: O O O C C C C C C C C C C C C C C C C C C C C C C C H H H H H H H H H H H H H H H H H H H H H H H H H H
charge: 0
multiplicity: 1
keywords: wb97x-d3
keywords: def2-TZVPP
keywords: def2/J RIJCOSX
keywords: DEFGRID2
keywords: scfconv7
keywords: smallprint printgap noloewdin
keywords: NOSOSCF
formula: C23H26O3
InChI: InChI=1/C23H26O3/c1-16(2)13-20-21(23(20,3)4)22(24)25-15-17-9-8-12-19(14-17)26-18-10-6-5-7-11-18/h5-14,20-21H,15H2,1-4H3
52 atoms
O  0.037128 -2.614021 -1.118618
O  -0.902422 -0.590504 -1.218831
O  3.608385 2.042985 -0.736828
C  -2.621121 -1.991957 1.080547
C  -3.436598 -1.70905 -0.148841
C  -2.115694 -2.431785 -0.283045
C  -3.041968 -3.096512 2.018405
C  -1.969599 -0.830951 1.791922
C  -4.687641 -2.430308 -0.461022
C  -0.965878 -1.758097 -0.917184
C  -5.85352 -1.882027 -0.819549
C  -7.041887 -2.74051 -1.136462
C  -6.100788 -0.409759 -0.95046
C  1.244503 -2.09092 -1.67603
C  1.978442 -1.201744 -0.711938
C  2.428978 0.04457 -1.126805
C  2.219709 -1.61819 0.593915
C  3.134417 0.855514 -0.250621
C  2.913111 -0.792102 1.465893
C  3.380562 0.447037 1.053124
C  3.444813 3.187898 -0.007495
C  2.288915 3.44598 0.72016
C  4.467662 4.124841 -0.065356
C  2.169707 4.651543 1.396531
C  4.3298 5.329422 0.608755
C  3.184752 5.597501 1.346235
H  -3.402873 -0.67208 -0.465462
H  -2.159416 -3.502039 -0.456005
H  -3.43174 -3.971297 1.499164
H  -3.817192 -2.744217 2.702331
H  -2.195003 -3.427091 2.623079
H  -1.036691 -1.137026 2.270749
H  -2.633196 -0.460941 2.576301
H  -1.748197 0.008213 1.135034
H  -4.639543 -3.514165 -0.40392
H  -6.814938 -3.804402 -1.065749
H  -7.410984 -2.542822 -2.146712
H  -7.873458 -2.527574 -0.459158
H  -5.280681 0.209165 -0.591191
H  -6.996984 -0.121771 -0.395001
H  -6.287751 -0.140062 -1.993881
H  1.042503 -1.569615 -2.614042
H  1.83981 -2.973688 -1.910746
H  2.231531 0.390465 -2.134746
H  1.873777 -2.586434 0.934291
H  3.103963 -1.119222 2.479843
H  3.932498 1.078347 1.738327
H  1.483203 2.723359 0.7580
H  5.362298 3.911832 -0.637252
H  1.268697 4.851924 1.962037
H  5.128865 6.058152 0.560704
H  3.082542 6.536006 1.874894
elementType: O C H
totalener: -1117.87053229 hartree
nucrepener: 2189.32898095 hartree
electener: -3307.19951324 hartree
oneelecener: -5868.51553926 hartree
twoeener: 2561.31602602 hartree
cpcmener: -0.02592875 hartree
kineticenergy: 1112.80360306 hartree
xcener: -110.226222795359 hartree
chargesum: 0.0000000
charge: -0.285740 -0.461706 -0.331614 0.107720 0.039755 -0.100483 -0.269085 -0.274948 -0.282771 0.382132 -0.041534 -0.220060 -0.255631 0.097344 0.043608 -0.234969 -0.257230 0.242051 -0.121351 -0.183348 0.263457 -0.172524 -0.238465 -0.157667 -0.129239 -0.180153 0.089106 0.090300 0.087627 0.097086 0.097171 0.093882 0.099127 0.093607 0.116403 0.087861 0.092364 0.093511 0.091469 0.092781 0.098814 0.115102 0.122976 0.131282 0.140099 0.158646 0.157340 0.157561 0.145172 0.158717 0.157132 0.157312
qa: -0.2857 -0.4617 -0.3316 0.1077 0.0398 -0.1005 -0.2691 -0.2749 -0.2828 0.3821 -0.0415 -0.2201 -0.2556 0.0973 0.0436 -0.2350 -0.2572 0.2421 -0.1214 -0.1833 0.2635 -0.1725 -0.2385 -0.1577 -0.1292 -0.1802 0.0891 0.0903 0.0876 0.0971 0.0972 0.0939 0.0991 0.0936 0.1164 0.0879 0.0924 0.0935 0.0915 0.0928 0.0988 0.1151 0.1230 0.1313 0.1401 0.1586 0.1573 0.1576 0.1452 0.1587 0.1571 0.1573
va: 2.1180 2.0475 2.0647 3.6993 3.7764 3.8171 3.9055 3.9048 3.8802 4.2233 3.7526 3.9229 3.9425 3.7922 3.6044 4.0553 3.9417 3.7595 3.8819 3.9282 3.7097 3.8826 3.9972 3.9033 3.8938 3.8983 1.0360 1.0360 1.0056 1.0020 1.0021 1.0017 1.0014 1.0161 1.0110 1.0089 0.9958 0.9965 1.0087 0.9980 0.9959 1.0096 0.9920 1.0188 1.0126 0.9898 0.9952 0.9976 1.0082 0.9908 0.9893 0.9905
dispcorr: -0.023608408 hartree
energy: -1117.894140698370
dipole: -33.18082 32.80380 -0.37703 -10.57055 9.75197 -0.81858 7.24058 -6.38426 0.85632
magnitude: 1.24318 au
magnitude: 3.15992 debye
