program: Orca
programVersion: 5.0.2
elementType: O O O C C C C C C C C C C C C C C C C C C C C C C C H H H H H H H H H H H H H H H H H H H H H H H H H H
charge: 0
multiplicity: 1
keywords: wb97x-d3
keywords: def2-TZVPP
keywords: def2/J RIJCOSX
keywords: DEFGRID2
keywords: scfconv7
keywords: smallprint printgap noloewdin
keywords: NOSOSCF
formula: C23H26O3
InChI: InChI=1/C23H26O3/c1-16(2)13-20-21(23(20,3)4)22(24)25-15-17-9-8-12-19(14-17)26-18-10-6-5-7-11-18/h5-14,20-21H,15H2,1-4H3
52 atoms
O  0.721226 -2.606598 -0.151837
O  -0.157416 -1.545727 1.61616
O  3.112293 2.130666 0.122232
C  -2.848158 -2.392132 0.234474
C  -2.56521 -0.940136 -0.006411
C  -1.497088 -1.970375 -0.317198
C  -3.741677 -3.139071 -0.726701
C  -2.984428 -2.874518 1.657839
C  -3.187923 -0.179942 -1.109462
C  -0.271023 -2.002785 0.502633
C  -3.874669 0.961903 -0.991275
C  -4.470158 1.62954 -2.194344
C  -4.131132 1.674809 0.301084
C  2.031919 -2.650926 0.433923
C  2.869482 -1.52312 -0.098305
C  2.614469 -0.21696 0.310815
C  3.873292 -1.766499 -1.028601
C  3.331606 0.832983 -0.242832
C  4.61383 -0.710893 -1.544224
C  4.340818 0.593727 -1.166909
C  1.839087 2.537351 0.425411
C  1.669532 3.32533 1.553535
C  0.75684 2.218381 -0.387048
C  0.403549 3.799389 1.870427
C  -0.503985 2.687407 -0.051167
C  -0.68777 3.477808 1.076306
H  -2.373065 -0.376924 0.900835
H  -1.343144 -2.203408 -1.365293
H  -4.792767 -2.964286 -0.486794
H  -3.562077 -4.213907 -0.658923
H  -3.58753 -2.847344 -1.765075
H  -4.035323 -2.844487 1.953055
H  -2.431304 -2.270139 2.373252
H  -2.646665 -3.908417 1.757424
H  -3.07983 -0.602102 -2.104709
H  -4.087984 2.648107 -2.308186
H  -5.556099 1.717846 -2.097142
H  -4.259418 1.087182 -3.11656
H  -3.813927 2.719003 0.237298
H  -3.634882 1.228658 1.16072
H  -5.203489 1.696006 0.516738
H  2.450736 -3.611786 0.137636
H  1.971469 -2.630625 1.522236
H  1.856907 -0.021308 1.05866
H  4.077391 -2.779976 -1.351456
H  5.399801 -0.902874 -2.26299
H  4.902193 1.42093 -1.582896
H  2.521415 3.56709 2.176644
H  0.889498 1.611074 -1.273869
H  0.272251 4.416861 2.749622
H  -1.346184 2.433911 -0.682307
H  -1.674234 3.841956 1.331833
elementType: O C H
totalener: -1117.86913726 hartree
nucrepener: 2314.07417728 hartree
electener: -3431.94331454 hartree
oneelecener: -6117.90112491 hartree
twoeener: 2685.95781038 hartree
cpcmener: -0.02407204 hartree
kineticenergy: 1112.79992695 hartree
xcener: -110.226539817216 hartree
chargesum: -0.0000000
charge: -0.284249 -0.478107 -0.332487 0.110036 0.034571 -0.086558 -0.267288 -0.279573 -0.266375 0.398875 -0.064290 -0.217311 -0.277708 0.084812 -0.019537 -0.173153 -0.227753 0.257855 -0.106958 -0.251127 0.292916 -0.246742 -0.214917 -0.116872 -0.120253 -0.205971 0.089143 0.088292 0.096626 0.097931 0.087339 0.094580 0.093489 0.098333 0.117808 0.091830 0.097110 0.088130 0.090524 0.097087 0.112345 0.112507 0.118577 0.153110 0.142616 0.157057 0.146165 0.145248 0.151262 0.156973 0.179399 0.154680
qa: -0.2842 -0.4781 -0.3325 0.1100 0.0346 -0.0866 -0.2673 -0.2796 -0.2664 0.3989 -0.0643 -0.2173 -0.2777 0.0848 -0.0195 -0.1732 -0.2278 0.2579 -0.1070 -0.2511 0.2929 -0.2467 -0.2149 -0.1169 -0.1203 -0.2060 0.0891 0.0883 0.0966 0.0979 0.0873 0.0946 0.0935 0.0983 0.1178 0.0918 0.0971 0.0881 0.0905 0.0971 0.1123 0.1125 0.1186 0.1531 0.1426 0.1571 0.1462 0.1452 0.1513 0.1570 0.1794 0.1547
va: 2.1289 2.0183 2.0775 3.7293 3.7373 3.8640 3.9114 3.9030 3.8289 4.1590 3.7543 3.9165 3.9388 3.8040 3.7178 3.8605 3.9755 3.7717 3.8898 4.0183 3.6798 4.0214 3.9440 3.9065 3.8296 3.9292 1.0330 1.0375 1.0024 1.0023 1.0055 1.0004 1.0193 0.9994 1.0106 0.9963 0.9958 1.0092 0.9931 1.0070 1.0002 1.0004 1.0174 1.0207 1.0034 0.9886 1.0065 1.0075 1.0024 0.9896 0.9704 0.9934
dispcorr: -0.026799805 hartree
energy: -1117.895937063206
dipole: -30.73611 30.03371 -0.70240 -3.88644 3.34729 -0.53914 -3.25197 2.43054 -0.82143
magnitude: 1.20780 au
magnitude: 3.06999 debye
