program: Gaussian 09
title: 000067690
version: EM64L-G09RevD.01
frameworkgroup: C1[X(C9H9F)]
method: RPBEPBE
basis: SDD
operation: Freq
keyword: #p
keyword: freq=noraman
keyword: PBEPBE/SDD
title: #p freq=noraman PBEPBE/SDD
converged: YES YES NO NO
title: Mulliken charges:
elementType: F C C C C C C C C C H H H H H H H H H
charge: -0.206316 0.353244 0.387642 -0.338447 -0.346203 -0.380254 -0.388538 -0.813843 0.322202 -0.695578 0.231451 0.242628 0.254256 0.253386 0.233510 0.225795 0.230508 0.218607 0.215950
chargesum: 0.00000
title: Mulliken charges with hydrogens summed into heavy atoms:
elementType: F C C C C C C C C C
charge: -0.206316 0.353244 0.387642 -0.106996 -0.103576 -0.125998 -0.135152 -0.124030 0.322202 -0.261021
polarizability: 1.41342887e+02 -1.04112481e+01 1.03546991e+02 2.13863173e+00 5.04541635e-01 4.55014984e+01
1716.lowfreq: -8.9525 -6.2404 0.0006 0.0009 0.0010 7.8415 34.7340 102.8022 202.2248
frequency: 34.7236 102.7981 202.2212 226.7047 280.9948 335.9505 371.7073 410.8642 448.7465 477.4994 489.5460 544.2129 629.4024 660.9165 671.0633 746.1194 804.0385 813.7479 840.4327 927.4186 931.7780 945.3321 957.4414 1001.9634 1003.9560 1048.5963 1110.6049 1116.8849 1159.0358 1210.0781 1298.9410 1307.9763 1365.0102 1392.8048 1409.7064 1431.3349 1469.4219 1482.5512 1499.7452 1592.1628 1610.2474 1644.3916 2973.2874 3050.0018 3095.2179 3105.6204 3152.1170 3155.9856 3175.0752 3179.3439 3204.2805
redmass: 3.0370 5.5564 2.8731 1.1654 5.3416 4.2636 5.3806 2.9552 3.6234 3.2396 2.9183 2.0327 6.9667 4.3826 1.4609 2.0926 6.5602 1.2514 1.6692 1.8445 1.4845 1.3581 1.3608 1.5888 2.2254 1.5155 1.8623 1.5482 1.6029 1.8841 1.4591 2.6005 5.5862 1.3005 3.2606 1.2668 1.0528 1.0945 2.4246 6.7868 6.3182 4.5670 1.0381 1.0968 1.0981 1.0623 1.0880 1.0878 1.0964 1.0972 1.1135
irintensity: 0.1353 0.0372 0.2641 0.9713 4.0442 1.4290 2.1037 0.1423 4.3975 10.9398 10.6818 3.9043 0.1426 10.8826 3.1629 5.8203 18.1586 0.5472 84.4544 18.2010 54.4536 1.1529 1.9614 5.4763 5.9645 3.9609 4.1238 9.2006 47.4748 30.9063 8.1952 24.4089 5.1519 21.1672 10.3268 1.0582 15.9954 41.2896 79.3641 3.5239 25.7316 19.7331 21.8734 22.6685 27.2463 4.8090 6.9528 7.9739 8.4978 1.8523 21.3219
temp: 298.150 k
press: 1.00000 atm
elementType: 9 6 6 6 6 6 6 6 6 6 1 1 1 1 1 1 1 1 1
symmnumber: 1
zpe: 395365.8 jmol-1
zpe.correction: 0.150587 hartree
zpe.thermalcorrener: 0.159645 hartree
zpe.thermalcorrenthalpy: 0.160590 hartree
zpe.thermalcorrgfe: 0.116003 hartree
zpe.sumelectzpe: -447.462199 hartree
zpe.sumelectthermal: -447.453140 hartree
zpe.sumelectthermalent: -447.452196 hartree
zpe.sumelectthermalfe: -447.496783 hartree
dipole: -2.1771 -0.3006 0.0817
dipole: 2.1992
quadrupole: -62.7869 -50.4846 -62.7271
quadrupole: 1.4447 -0.0555 0.5057
quadrupole: -4.1207 8.1816 -4.0609 1.4447 -0.0555 0.5057
hfenergy: -447.6127859 hartree
pointgroup: C01 [X(C9H9F1)]
dipole: -0.8548031 0.1262536 -0.0449197 debye
dipolederiv: -1.2716906 -0.0465548 -0.0056417 -0.0205657 -0.2108124 -0.0054644 -0.0063303 -0.0041832 -0.1518714 0.135233 0.0961861 -0.0254426 0.1216254 -0.16021 0.0183646 -0.0821764 -0.0074914 0.0037086 0.4113557 -0.0500017 0.0088919 -0.1147924 0.2682191 -0.0849279 0.0783718 -0.0350761 -0.0242553 -0.0216296 -0.0207268 0.0126575 0.0480158 0.0901817 0.0345904 0.0373948 0.0225325 -0.1337916 0.0239951 0.0132793 0.0079874 -0.087075 0.0725402 0.0102935 -0.01185 0.0242967 -0.1566674 -0.2129163 -0.0178043 -0.0050556 -0.2137132 -0.0289838 0.0156451 -0.0209549 0.0104998 -0.1523548 -0.2365901 -0.0017973 0.0024772 0.245851 -0.0083845 0.0091124 0.0224057 0.0140988 -0.1581469 -0.0675651 0.0635799 -0.0079057 0.0868343 -0.1001241 0.0354989 -0.0270496 0.0123899 0.0853151 1.3108772 0.0372062 0.0097453 0.0103898 0.2491358 0.0137922 0.0085671 0.0130054 0.0827751 -0.2025097 -0.1140818 0.0410318 -0.1221056 -0.1776517 -0.0708709 0.0417687 -0.0652973 -0.3971555 0.0534509 -0.0956236 -0.0144209 -0.059881 -0.0330438 -0.02286 -0.0159642 -0.014078 0.1389082 0.0643933 0.0906055 0.0090358 0.0907866 -0.0364942 -0.0103136 0.014734 -0.0143273 0.1416186 0.0360352 0.0661447 0.0043784 0.0798292 -0.0001125 -0.0156159 0.0036656 -0.0185998 0.1789991 0.0449413 -0.0650527 -0.0052147 -0.0786649 -0.0092294 -0.0138888 -0.006597 -0.0134803 0.1798451 0.0772148 -0.0314429 0.0929868 -0.012748 0.0195306 0.0802689 0.0568305 0.0981742 -0.065574 0.1053692 -0.036857 -0.0630484 -0.0103331 -0.0547236 -0.0866224 -0.0322021 -0.1120865 -0.0228886 -0.1653639 0.0174628 -0.0277533 -0.0826429 0.0841134 -0.000247 -0.0046074 0.0105179 0.1064913 -0.1324089 -0.0081381 -0.0062774 0.0267368 0.0895716 0.0250921 -0.0344031 0.0157862 0.1747503 0.0478085 0.1036165 -0.0284317 0.092453 -0.0535225 0.068153 -0.0216033 0.0633184 0.1702942 unknown
polarizability: 141.5995948|9.9471569|103.3045111|-1.4758217|-1.2278544|45.4872707 unknown
InChI: InChI=1S/C9H9F/c1-7(2)8-3-5-9(10)6-4-8/h3-6H,1H2,2H3
charge 0 multiplicity 1
19 atoms
F  3.550884 0.052339 0.030004
C  -0.683415 -0.046504 -0.009079
C  -2.17876 -0.068164 -0.015154
C  0.085261 -1.244312 -0.099719
C  0.024632 1.186186 0.074367
C  1.493217 -1.222899 -0.083584
C  1.435566 1.232387 0.092305
C  -2.904065 1.240263 -0.298283
C  2.140552 0.021739 0.017002
C  -2.898202 -1.200837 0.236961
H  -0.42134 -2.208208 -0.207608
H  -0.526489 2.128987 0.136339
H  2.082113 -2.141648 -0.158572
H  1.977873 2.179587 0.162818
H  -2.553829 1.702645 -1.240244
H  -2.739906 1.978436 0.510714
H  -3.990927 1.074534 -0.378208
H  -3.992915 -1.19047 0.212571
H  -2.431249 -2.15766 0.493568
