program: Orca
programVersion: 5.0.2
elementType: O O O C C C C C C C C C C C C C C C C C C C C C C C H H H H H H H H H H H H H H H H H H H H H H H H H H
charge: 0
multiplicity: 1
keywords: wb97x-d3
keywords: def2-TZVPP
keywords: def2/J RIJCOSX
keywords: DEFGRID2
keywords: scfconv7
keywords: smallprint printgap noloewdin
keywords: NOSOSCF
formula: C23H26O3
InChI: InChI=1/C23H26O3/c1-16(2)13-20-21(23(20,3)4)22(24)25-15-17-9-8-12-19(14-17)26-18-10-6-5-7-11-18/h5-14,20-21H,15H2,1-4H3
52 atoms
O  0.154137 -2.822299 0.31216
O  0.301584 -2.572143 -1.89917
O  1.858933 1.814383 1.416497
C  -2.860241 -3.18025 -0.128494
C  -2.564005 -1.785783 0.304923
C  -1.824081 -2.36808 -0.891542
C  -4.131513 -3.454555 -0.897411
C  -2.461091 -4.33382 0.759867
C  -3.528053 -0.669747 0.123477
C  -0.36803 -2.59872 -0.891737
C  -3.200498 0.618256 -0.011579
C  -4.250441 1.67962 -0.13396
C  -1.788918 1.118752 -0.041465
C  1.575408 -2.928622 0.409802
C  2.247593 -1.596638 0.229388
C  1.745099 -0.471839 0.878001
C  3.375261 -1.476735 -0.571794
C  2.372664 0.752455 0.7224
C  4.008506 -0.247638 -0.703483
C  3.515236 0.875524 -0.059772
C  1.60664 2.995119 0.778995
C  1.278936 3.073196 -0.569803
C  1.640962 4.141647 1.563403
C  0.996462 4.313189 -1.127313
C  1.348438 5.37123 0.993185
C  1.029789 5.465887 -0.355231
H  -1.955056 -1.717221 1.202625
H  -2.162766 -2.021554 -1.861513
H  -4.971969 -3.603111 -0.215726
H  -4.027078 -4.364828 -1.491418
H  -4.396101 -2.647413 -1.580772
H  -2.178509 -5.208602 0.170378
H  -3.312197 -4.622296 1.380593
H  -1.639838 -4.099238 1.43265
H  -4.582775 -0.930721 0.142179
H  -5.260007 1.271775 -0.080733
H  -4.152961 2.219309 -1.079842
H  -4.146848 2.426865 0.657722
H  -1.635215 1.784934 -0.894874
H  -1.048138 0.321672 -0.100991
H  -1.570512 1.710637 0.853087
H  1.963383 -3.663423 -0.298104
H  1.750549 -3.313113 1.41494
H  0.86698 -0.537501 1.509632
H  3.761667 -2.342922 -1.094735
H  4.893358 -0.160403 -1.320608
H  4.01342 1.830928 -0.167906
H  1.234423 2.185536 -1.187937
H  1.891527 4.067652 2.614512
H  0.743941 4.370745 -2.178468
H  1.376779 6.260257 1.610182
H  0.809879 6.427841 -0.799352
elementType: O C H
totalener: -1117.86673228 hartree
nucrepener: 2301.81063517 hartree
electener: -3419.67736745 hartree
oneelecener: -6093.09893817 hartree
twoeener: 2673.42157072 hartree
cpcmener: -0.02566010 hartree
kineticenergy: 1112.79520117 hartree
xcener: -110.225979996841 hartree
chargesum: 0.0000000
charge: -0.279611 -0.467496 -0.329377 0.157945 -0.018269 -0.102448 -0.297000 -0.275622 -0.292706 0.387325 -0.001436 -0.228400 -0.231111 0.075428 0.044725 -0.287304 -0.202848 0.261479 -0.126300 -0.193402 0.317563 -0.223746 -0.256685 -0.148189 -0.121795 -0.190563 0.107998 0.088996 0.098468 0.098312 0.093331 0.100633 0.092621 0.091471 0.121198 0.088635 0.095291 0.094766 0.093153 0.053807 0.107540 0.116233 0.116310 0.140549 0.141916 0.158691 0.156675 0.155075 0.144627 0.158949 0.156656 0.157941
qa: -0.2796 -0.4675 -0.3294 0.1579 -0.0183 -0.1024 -0.2970 -0.2756 -0.2927 0.3873 -0.0014 -0.2284 -0.2311 0.0754 0.0447 -0.2873 -0.2028 0.2615 -0.1263 -0.1934 0.3176 -0.2237 -0.2567 -0.1482 -0.1218 -0.1906 0.1080 0.0890 0.0985 0.0983 0.0933 0.1006 0.0926 0.0915 0.1212 0.0886 0.0953 0.0948 0.0932 0.0538 0.1075 0.1162 0.1163 0.1405 0.1419 0.1587 0.1567 0.1551 0.1446 0.1589 0.1567 0.1579
va: 2.1033 2.0396 2.0527 3.6914 3.7953 3.8192 3.9191 3.8919 3.8677 4.1597 3.7574 3.9276 3.9357 3.8230 3.6363 4.0061 3.9698 3.7526 3.8860 3.9394 3.6133 3.8601 4.0109 3.9021 3.8923 3.9092 1.0181 1.0297 0.9994 1.0023 1.0018 0.9997 1.0010 1.0141 1.0029 1.0071 0.9970 0.9956 1.0006 1.0131 0.9969 1.0077 0.9953 1.0179 1.0028 0.9900 0.9957 1.0001 1.0092 0.9903 0.9892 0.9902
dispcorr: -0.027364297 hartree
energy: -1117.894096579272
dipole: -22.94897 22.60876 -0.34021 -4.27052 4.39360 0.12308 -1.31465 1.93968 0.62503
magnitude: 0.72218 au
magnitude: 1.83565 debye
