program: Orca
programVersion: 5.0.2
elementType: O O O C C C C C C C C C C C C C C C C C C C C C C C H H H H H H H H H H H H H H H H H H H H H H H H H H
charge: 0
multiplicity: 1
keywords: wb97x-d3
keywords: def2-TZVPP
keywords: def2/J RIJCOSX
keywords: DEFGRID2
keywords: scfconv7
keywords: smallprint printgap noloewdin
keywords: NOSOSCF
formula: C23H26O3
InChI: InChI=1/C23H26O3/c1-16(2)13-20-21(23(20,3)4)22(24)25-15-17-9-8-12-19(14-17)26-18-10-6-5-7-11-18/h5-14,20-21H,15H2,1-4H3
52 atoms
O  0.727674 -2.567369 -0.214865
O  -0.180562 -1.781503 1.677823
O  3.111295 2.106484 0.230584
C  -2.854537 -2.445666 0.165684
C  -2.577138 -0.973451 0.107517
C  -1.498381 -1.954336 -0.3106
C  -3.729808 -3.077331 -0.890376
C  -3.005174 -3.096937 1.518448
C  -3.182276 -0.087546 -0.906957
C  -0.279951 -2.081179 0.51088
C  -3.848156 1.047627 -0.668816
C  -4.430876 1.845856 -1.796282
C  -4.103205 1.614135 0.695969
C  2.033809 -2.683272 0.366636
C  2.899127 -1.540444 -0.0835
C  2.595829 -0.241105 0.313114
C  3.991963 -1.767292 -0.911747
C  3.366375 0.817324 -0.144086
C  4.776806 -0.70287 -1.335646
C  4.463922 0.594863 -0.965647
C  1.812681 2.532961 0.326671
C  1.476085 3.316994 1.42029
C  0.872036 2.24418 -0.655702
C  0.186937 3.821067 1.527575
C  -0.414963 2.746097 -0.530399
C  -0.764354 3.534411 0.55876
H  -2.407054 -0.524777 1.080677
H  -1.330279 -2.054144 -1.37746
H  -4.784928 -2.925945 -0.653218
H  -3.554224 -4.154004 -0.937093
H  -3.553874 -2.675239 -1.887459
H  -4.061348 -3.120583 1.794941
H  -2.475574 -2.572277 2.310143
H  -2.649609 -4.129413 1.500394
H  -3.07882 -0.403704 -1.941216
H  -4.008084 2.853952 -1.824507
H  -5.51033 1.970221 -1.671815
H  -4.257388 1.380653 -2.766797
H  -3.985927 2.69989 0.694862
H  -3.449366 1.212118 1.46832
H  -5.133698 1.417319 1.006647
H  2.436088 -3.630218 0.008423
H  1.971693 -2.734222 1.453806
H  1.764529 -0.053336 0.981684
H  4.231273 -2.775265 -1.227432
H  5.628812 -0.882843 -1.978254
H  5.06165 1.429656 -1.309575
H  2.219091 3.533943 2.177601
H  1.135156 1.638885 -1.514401
H  -0.072956 4.435604 2.379926
H  -1.145701 2.523024 -1.297168
H  -1.768794 3.927066 0.646999
elementType: O C H
totalener: -1117.86899645 hartree
nucrepener: 2311.54703903 hartree
electener: -3429.41603548 hartree
oneelecener: -6112.83607411 hartree
twoeener: 2683.42003864 hartree
cpcmener: -0.02455950 hartree
kineticenergy: 1112.79640511 hartree
xcener: -110.225637947332 hartree
chargesum: 0.0000000
charge: -0.285166 -0.477966 -0.332419 0.108878 0.038418 -0.095155 -0.267417 -0.278983 -0.270438 0.405018 -0.074576 -0.211862 -0.279489 0.088648 -0.015659 -0.155883 -0.225007 0.233989 -0.109764 -0.243799 0.280027 -0.244285 -0.176285 -0.122104 -0.159601 -0.188634 0.096564 0.087733 0.097025 0.097251 0.087209 0.094528 0.092530 0.098073 0.116977 0.089379 0.100836 0.089053 0.088139 0.098320 0.115642 0.110318 0.117899 0.152008 0.142534 0.157379 0.146784 0.144662 0.152214 0.156775 0.164133 0.165549
qa: -0.2852 -0.4780 -0.3324 0.1089 0.0384 -0.0952 -0.2674 -0.2790 -0.2704 0.4050 -0.0746 -0.2119 -0.2795 0.0886 -0.0157 -0.1559 -0.2250 0.2340 -0.1098 -0.2438 0.2800 -0.2443 -0.1763 -0.1221 -0.1596 -0.1886 0.0966 0.0877 0.0970 0.0973 0.0872 0.0945 0.0925 0.0981 0.1170 0.0894 0.1008 0.0891 0.0881 0.0983 0.1156 0.1103 0.1179 0.1520 0.1425 0.1574 0.1468 0.1447 0.1522 0.1568 0.1641 0.1655
va: 2.1282 2.0200 2.0721 3.7224 3.7400 3.8567 3.9115 3.9047 3.8198 4.1633 3.7550 3.9098 3.9354 3.8032 3.7364 3.8656 3.9677 3.7858 3.8940 4.0145 3.6907 4.0190 3.8939 3.9089 3.8614 3.8933 1.0294 1.0377 1.0020 1.0024 1.0059 1.0004 1.0195 0.9993 1.0110 0.9961 0.9964 1.0091 0.9988 1.0061 0.9982 1.0016 1.0188 1.0188 1.0038 0.9888 1.0060 1.0079 1.0007 0.9900 0.9848 0.9837
dispcorr: -0.026711933 hartree
energy: -1117.895708377983
dipole: -30.62269 29.94858 -0.67411 -3.56903 3.12809 -0.44094 -2.95158 2.00766 -0.94393
magnitude: 1.24091 au
magnitude: 3.15414 debye
