program: Orca
programVersion: 5.0.2
elementType: O O O C C C C C C C C C C C C C C C C C C C C C C C H H H H H H H H H H H H H H H H H H H H H H H H H H
charge: 0
multiplicity: 1
keywords: wb97x-d3
keywords: def2-TZVPP
keywords: def2/J RIJCOSX
keywords: DEFGRID2
keywords: scfconv7
keywords: smallprint printgap noloewdin
keywords: NOSOSCF
formula: C23H26O3
InChI: InChI=1/C23H26O3/c1-16(2)13-20-21(23(20,3)4)22(24)25-15-17-9-8-12-19(14-17)26-18-10-6-5-7-11-18/h5-14,20-21H,15H2,1-4H3
52 atoms
O  -0.03737 -2.616268 0.670179
O  -0.405636 -1.939477 -1.427665
O  2.510201 1.631322 1.326502
C  -2.386229 -0.060952 0.251912
C  -3.125886 -1.004362 -0.637624
C  -2.050264 -1.54839 0.269982
C  -3.05573 0.460401 1.499202
C  -1.432406 0.931637 -0.368631
C  -4.549369 -1.363901 -0.401553
C  -0.776835 -2.040594 -0.28292
C  -5.078656 -2.570555 -0.618301
C  -6.530264 -2.844256 -0.369211
C  -4.287051 -3.739685 -1.118009
C  1.303084 -2.96845 0.335687
C  2.156799 -1.757116 0.078441
C  1.951406 -0.586299 0.800884
C  3.163725 -1.802324 -0.877003
C  2.742397 0.52447 0.55708
C  3.964478 -0.689656 -1.096605
C  3.762391 0.482563 -0.385722
C  2.441676 2.870964 0.756863
C  1.952621 3.086489 -0.526712
C  2.835801 3.940522 1.5509
C  1.873407 4.385033 -1.011096
C  2.741064 5.232337 1.055986
C  2.265658 5.461955 -0.228212
H  -2.831666 -0.951869 -1.683893
H  -2.383325 -2.07209 1.159641
H  -2.307807 0.741144 2.243593
H  -3.717348 -0.273706 1.95972
H  -3.648609 1.350985 1.278635
H  -0.644395 1.211839 0.33371
H  -1.971749 1.844092 -0.632276
H  -0.960076 0.562481 -1.277274
H  -5.201668 -0.569459 -0.048802
H  -7.03398 -3.163175 -1.285589
H  -7.055465 -1.970092 0.016032
H  -6.656697 -3.657783 0.3503
H  -4.281702 -4.547705 -0.381137
H  -3.25278 -3.493815 -1.351964
H  -4.742337 -4.153344 -2.021751
H  1.329177 -3.650592 -0.517025
H  1.667942 -3.516028 1.205764
H  1.173429 -0.520924 1.55229
H  3.32078 -2.704351 -1.455489
H  4.75246 -0.731711 -1.837494
H  4.389722 1.346435 -0.566185
H  1.630798 2.26058 -1.148462
H  3.209882 3.758576 2.550802
H  1.493866 4.551188 -2.011234
H  3.048193 6.062459 1.67909
H  2.198314 6.470628 -0.613956
elementType: O C H
totalener: -1117.86832211 hartree
nucrepener: 2267.28432239 hartree
electener: -3385.15264450 hartree
oneelecener: -6024.31889998 hartree
twoeener: 2639.16625549 hartree
cpcmener: -0.02460693 hartree
kineticenergy: 1112.80619577 hartree
xcener: -110.228085527683 hartree
chargesum: 0.0000000
charge: -0.290560 -0.457992 -0.332636 0.171318 -0.015995 -0.113710 -0.289107 -0.289079 -0.295223 0.369840 -0.017405 -0.228557 -0.237777 0.097654 0.051878 -0.303700 -0.214267 0.275650 -0.125307 -0.196302 0.320759 -0.206457 -0.259016 -0.161623 -0.123177 -0.185379 0.104275 0.096617 0.098481 0.093742 0.098437 0.084235 0.105071 0.097446 0.121644 0.096154 0.088978 0.093270 0.098133 0.079149 0.099774 0.115124 0.120668 0.136857 0.140873 0.158566 0.156047 0.154266 0.144987 0.158456 0.157395 0.157528
qa: -0.2906 -0.4580 -0.3326 0.1713 -0.0160 -0.1137 -0.2891 -0.2891 -0.2952 0.3698 -0.0174 -0.2286 -0.2378 0.0977 0.0519 -0.3037 -0.2143 0.2757 -0.1253 -0.1963 0.3208 -0.2065 -0.2590 -0.1616 -0.1232 -0.1854 0.1043 0.0966 0.0985 0.0937 0.0984 0.0842 0.1051 0.0974 0.1216 0.0962 0.0890 0.0933 0.0981 0.0791 0.0998 0.1151 0.1207 0.1369 0.1409 0.1586 0.1560 0.1543 0.1450 0.1585 0.1574 0.1575
va: 2.1080 2.0418 2.0545 3.7077 3.8348 3.8030 3.9024 3.8840 3.8894 4.1856 3.7122 3.9311 3.9328 3.7965 3.6059 4.0195 3.9814 3.7287 3.8902 3.9365 3.6387 3.8828 4.0135 3.9186 3.8910 3.9057 1.0252 1.0306 1.0037 1.0019 1.0000 1.0027 1.0037 1.0149 1.0032 0.9961 1.0064 0.9967 0.9986 1.0173 0.9999 1.0089 0.9926 1.0255 1.0032 0.9899 0.9959 0.9982 1.0091 0.9910 0.9892 0.9904
dispcorr: -0.026366990 hartree
energy: -1117.894689098746
dipole: -26.88979 26.69155 -0.19824 -5.51356 5.40514 -0.10842 -2.15825 2.54371 0.38546
magnitude: 0.44680 au
magnitude: 1.13568 debye
