program: Orca
programVersion: 5.0.2
elementType: O O O C C C C C C C C C C C C C C C C C C C C C C C H H H H H H H H H H H H H H H H H H H H H H H H H H
charge: 0
multiplicity: 1
keywords: wb97x-d3
keywords: def2-TZVPP
keywords: def2/J RIJCOSX
keywords: DEFGRID2
keywords: scfconv7
keywords: smallprint printgap noloewdin
keywords: NOSOSCF
formula: C23H26O3
InChI: InChI=1/C23H26O3/c1-16(2)13-20-21(23(20,3)4)22(24)25-15-17-9-8-12-19(14-17)26-18-10-6-5-7-11-18/h5-14,20-21H,15H2,1-4H3
52 atoms
O  -0.013683 -1.851491 -1.730168
O  -0.835768 -0.03854 -0.714612
O  3.98554 1.829077 0.673905
C  -2.311857 -2.40886 0.834531
C  -3.279367 -1.588934 0.028159
C  -2.029379 -2.116149 -0.630521
C  -2.65017 -3.840277 1.170456
C  -1.518975 -1.718071 1.916584
C  -4.595079 -2.115324 -0.39648
C  -0.932824 -1.205311 -1.010325
C  -5.787988 -1.594928 -0.091435
C  -7.052621 -2.218888 -0.599774
C  -5.989721 -0.37309 0.752383
C  1.185603 -1.146793 -2.05502
C  2.023682 -0.877445 -0.835715
C  2.592642 0.375823 -0.656792
C  2.244675 -1.879185 0.106233
C  3.367988 0.62873 0.468257
C  3.021958 -1.61489 1.222765
C  3.582852 -0.360856 1.415728
C  3.363926 3.001045 0.339539
C  4.162947 4.007883 -0.184633
C  2.009203 3.21726 0.564886
C  3.601678 5.241398 -0.482137
C  1.459991 4.452137 0.251009
C  2.248758 5.468467 -0.271603
H  -3.249152 -0.528175 0.255399
H  -2.149573 -2.969787 -1.289639
H  -1.743337 -4.402239 1.403607
H  -3.156306 -4.359099 0.356963
H  -3.29993 -3.885486 2.047205
H  -0.543852 -2.190741 2.0558
H  -2.054451 -1.790289 2.865538
H  -1.353246 -0.660518 1.719928
H  -4.576574 -3.009478 -1.013549
H  -7.693702 -2.538676 0.226305
H  -6.86103 -3.086718 -1.231007
H  -7.637811 -1.502513 -1.183078
H  -5.077397 -0.006826 1.219015
H  -6.707782 -0.574115 1.55121
H  -6.412472 0.442917 0.160014
H  0.96101 -0.221405 -2.589767
H  1.710491 -1.807691 -2.745474
H  2.421517 1.151074 -1.394472
H  1.81154 -2.86299 -0.024745
H  3.190868 -2.390896 1.958093
H  4.183805 -0.151122 2.291597
H  5.217239 3.826428 -0.352801
H  1.382229 2.43776 0.979727
H  4.228335 6.025404 -0.887513
H  0.404602 4.618876 0.424451
H  1.812584 6.42946 -0.51058
elementType: O C H
totalener: -1117.86999504 hartree
nucrepener: 2216.82794569 hartree
electener: -3334.69794073 hartree
oneelecener: -5923.52156800 hartree
twoeener: 2588.82362727 hartree
cpcmener: -0.02541058 hartree
kineticenergy: 1112.80525167 hartree
xcener: -110.227281650701 hartree
chargesum: -0.0000000
charge: -0.283522 -0.460537 -0.330098 0.130974 0.028929 -0.108554 -0.266054 -0.282777 -0.286891 0.374216 -0.031325 -0.222710 -0.255132 0.092185 0.057108 -0.213961 -0.288959 0.284535 -0.095910 -0.253763 0.286235 -0.250486 -0.191133 -0.120938 -0.144921 -0.188174 0.091449 0.090583 0.097474 0.087461 0.097102 0.091926 0.100373 0.095101 0.117927 0.093476 0.087581 0.092840 0.090272 0.092767 0.098716 0.115310 0.122440 0.140939 0.140948 0.156839 0.145482 0.144306 0.156260 0.157676 0.158599 0.157819
qa: -0.2835 -0.4605 -0.3301 0.1310 0.0289 -0.1086 -0.2661 -0.2828 -0.2869 0.3742 -0.0313 -0.2227 -0.2551 0.0922 0.0571 -0.2140 -0.2890 0.2845 -0.0959 -0.2538 0.2862 -0.2505 -0.1911 -0.1209 -0.1449 -0.1882 0.0914 0.0906 0.0975 0.0875 0.0971 0.0919 0.1004 0.0951 0.1179 0.0935 0.0876 0.0928 0.0903 0.0928 0.0987 0.1153 0.1224 0.1409 0.1409 0.1568 0.1455 0.1443 0.1563 0.1577 0.1586 0.1578
va: 2.1148 2.0453 2.0757 3.6821 3.7845 3.8416 3.9018 3.9019 3.8821 4.2222 3.7315 3.9252 3.9446 3.8011 3.5878 3.9428 3.9451 3.7175 3.8704 4.0212 3.6970 4.0095 3.9053 3.8826 3.8952 3.9071 1.0317 1.0376 1.0026 1.0047 1.0027 1.0029 1.0022 1.0153 1.0093 0.9967 1.0087 0.9951 1.0080 0.9981 0.9963 1.0101 0.9918 1.0081 1.0126 0.9887 1.0069 1.0088 0.9998 0.9891 0.9907 0.9905
dispcorr: -0.024354769 hartree
energy: -1117.894349812310
dipole: -32.92157 32.30735 -0.61422 -13.20632 12.31642 -0.88990 5.85584 -6.01821 -0.16237
magnitude: 1.09341 au
magnitude: 2.77923 debye
