program: Orca
programVersion: 5.0.2
elementType: O O O C C C C C C C C C C C C C C C C C C C C C C C H H H H H H H H H H H H H H H H H H H H H H H H H H
charge: 0
multiplicity: 1
keywords: wb97x-d3
keywords: def2-TZVPP
keywords: def2/J RIJCOSX
keywords: DEFGRID2
keywords: scfconv7
keywords: smallprint printgap noloewdin
keywords: NOSOSCF
formula: C23H26O3
InChI: InChI=1/C23H26O3/c1-16(2)13-20-21(23(20,3)4)22(24)25-15-17-9-8-12-19(14-17)26-18-10-6-5-7-11-18/h5-14,20-21H,15H2,1-4H3
52 atoms
O  0.421334 -2.374252 -1.149873
O  0.242993 -2.185314 1.06814
O  2.657374 2.103273 -0.267589
C  -2.825917 -2.291625 0.529407
C  -2.416755 -0.856483 0.58522
C  -1.667749 -1.804308 -0.328518
C  -4.069835 -2.658007 -0.244773
C  -2.590885 -3.179428 1.72625
C  -3.28936 0.219789 0.051247
C  -0.26494 -2.13763 -0.026753
C  -3.015857 1.08971 -0.924933
C  -4.022726 2.119416 -1.341524
C  -1.729442 1.138718 -1.689854
C  1.802641 -2.69363 -1.030653
C  2.658888 -1.545794 -0.565269
C  2.235288 -0.227888 -0.661612
C  3.923165 -1.821788 -0.050836
C  3.051335 0.79433 -0.194116
C  4.746742 -0.789221 0.367982
C  4.310805 0.52757 0.316856
C  1.433514 2.48221 0.206971
C  0.76308 1.798713 1.216074
C  0.892143 3.639959 -0.338147
C  -0.458824 2.281248 1.664716
C  -0.326132 4.112606 0.126992
C  -1.011451 3.434994 1.126482
H  -1.868356 -0.590859 1.487615
H  -1.890106 -1.727077 -1.386457
H  -4.957381 -2.561011 0.383898
H  -4.020802 -3.694366 -0.584981
H  -4.215391 -2.028234 -1.122295
H  -2.375419 -4.206149 1.421822
H  -3.493877 -3.205895 2.340655
H  -1.777184 -2.839442 2.362538
H  -4.256791 0.301176 0.541953
H  -4.958922 2.033263 -0.789824
H  -4.25092 2.03514 -2.407604
H  -3.63163 3.129397 -1.190056
H  -1.370442 2.167397 -1.762816
H  -1.875954 0.793107 -2.717539
H  -0.935979 0.542466 -1.247037
H  2.100946 -3.00078 -2.033941
H  1.941195 -3.555835 -0.373985
H  1.267676 0.016763 -1.082648
H  4.26256 -2.847926 0.026925
H  5.729872 -1.010535 0.763078
H  4.938211 1.335894 0.670513
H  1.176791 0.901107 1.657907
H  1.425043 4.166019 -1.120698
H  -0.978376 1.745281 2.448827
H  -0.742545 5.015063 -0.302084
H  -1.96583 3.801006 1.481423
elementType: O C H
totalener: -1117.86749260 hartree
nucrepener: 2389.27254553 hartree
electener: -3507.14003813 hartree
oneelecener: -6268.34732102 hartree
twoeener: 2761.20728289 hartree
cpcmener: -0.02461761 hartree
kineticenergy: 1112.79981458 hartree
xcener: -110.233030079790 hartree
chargesum: -0.0000000
charge: -0.295441 -0.459960 -0.328342 0.121243 -0.016689 -0.028334 -0.279334 -0.284250 -0.294089 0.329342 -0.008199 -0.226303 -0.222883 0.064719 0.034449 -0.249791 -0.214846 0.254534 -0.120003 -0.242510 0.316527 -0.195194 -0.258730 -0.147286 -0.115558 -0.199486 0.092293 0.104436 0.097270 0.099091 0.090446 0.098734 0.093130 0.093861 0.114513 0.088840 0.098227 0.091645 0.102997 0.120056 0.031835 0.126983 0.116794 0.205304 0.140337 0.157147 0.145675 0.147093 0.141659 0.160080 0.153628 0.154340
qa: -0.2954 -0.4600 -0.3283 0.1212 -0.0167 -0.0283 -0.2793 -0.2843 -0.2941 0.3293 -0.0082 -0.2263 -0.2229 0.0647 0.0344 -0.2498 -0.2148 0.2545 -0.1200 -0.2425 0.3165 -0.1952 -0.2587 -0.1473 -0.1156 -0.1995 0.0923 0.1044 0.0973 0.0991 0.0904 0.0987 0.0931 0.0939 0.1145 0.0888 0.0982 0.0916 0.1030 0.1201 0.0318 0.1270 0.1168 0.2053 0.1403 0.1571 0.1457 0.1471 0.1417 0.1601 0.1536 0.1543
va: 2.1145 2.0343 2.0842 3.7851 3.7724 3.7667 3.9004 3.8876 3.8338 4.1711 3.7385 3.9239 3.8930 3.8183 3.6094 3.9452 3.9661 3.7475 3.8838 4.0181 3.6590 3.8286 3.9739 3.8398 3.8495 3.8564 1.0223 1.0255 1.0017 1.0026 1.0051 0.9987 1.0007 1.0210 1.0083 1.0069 0.9975 0.9968 1.0018 1.0034 1.0292 0.9897 1.0088 0.9585 1.0009 0.9889 1.0058 1.0095 1.0105 0.9891 0.9905 0.9925
dispcorr: -0.031116327 hartree
energy: -1117.898608926588
dipole: -25.28163 24.57366 -0.70797 -3.19022 2.79372 -0.39650 -2.25192 1.43757 -0.81435
magnitude: 1.14961 au
magnitude: 2.92208 debye
