program: Orca
programVersion: 5.0.2
elementType: O O O C C C C C C C C C C C C C C C C C C C C C C C H H H H H H H H H H H H H H H H H H H H H H H H H H
charge: 0
multiplicity: 1
keywords: wb97x-d3
keywords: def2-TZVPP
keywords: def2/J RIJCOSX
keywords: DEFGRID2
keywords: scfconv7
keywords: smallprint printgap noloewdin
keywords: NOSOSCF
formula: C23H26O3
InChI: InChI=1/C23H26O3/c1-16(2)13-20-21(23(20,3)4)22(24)25-15-17-9-8-12-19(14-17)26-18-10-6-5-7-11-18/h5-14,20-21H,15H2,1-4H3
52 atoms
O  0.007579 -2.064753 -1.086197
O  -0.65954 0.070535 -1.003732
O  3.808589 1.792211 0.357535
C  -2.382629 -0.973216 1.401379
C  -3.237241 -0.873317 0.186097
C  -1.921927 -1.631131 0.108133
C  -2.767828 -1.935495 2.49908
C  -1.702007 0.27125 1.917793
C  -4.524392 -1.600035 0.044835
C  -0.816863 -1.08998 -0.701128
C  -5.098549 -1.911844 -1.12016
C  -6.424252 -2.607619 -1.176941
C  -4.486323 -1.594232 -2.449496
C  1.172962 -1.721042 -1.850464
C  2.283664 -1.27789 -0.942649
C  2.536888 0.074535 -0.752597
C  3.037686 -2.22404 -0.252849
C  3.513282 0.473891 0.150632
C  4.029871 -1.814532 0.624176
C  4.264838 -0.464532 0.842046
C  2.804815 2.717525 0.445301
C  3.080878 3.987095 -0.044615
C  1.580452 2.441195 1.043972
C  2.124882 4.98604 0.067025
C  0.630787 3.448267 1.138998
C  0.894339 4.721786 0.652876
H  -3.199615 0.095618 -0.305821
H  -1.995423 -2.712714 0.099702
H  -1.891907 -2.205968 3.091929
H  -3.201237 -2.859394 2.11657
H  -3.494472 -1.481536 3.175918
H  -0.739764 0.035731 2.377256
H  -2.325073 0.733545 2.686328
H  -1.536216 1.017387 1.144535
H  -5.041283 -1.868583 0.96193
H  -6.826261 -2.810259 -0.184159
H  -6.346584 -3.558934 -1.710164
H  -7.159253 -2.008765 -1.721445
H  -3.490848 -1.158669 -2.374626
H  -5.114941 -0.893849 -3.006999
H  -4.411291 -2.494344 -3.065678
H  0.937593 -0.964727 -2.599938
H  1.441508 -2.639353 -2.370417
H  1.968098 0.812062 -1.304632
H  2.851522 -3.280322 -0.405409
H  4.620109 -2.550018 1.155536
H  5.029022 -0.140233 1.537264
H  4.039287 4.188757 -0.507354
H  1.362473 1.456915 1.439286
H  2.344128 5.974471 -0.316296
H  -0.321827 3.231186 1.6058
H  0.148291 5.501507 0.732705
elementType: O C H
totalener: -1117.86839646 hartree
nucrepener: 2271.06787245 hartree
electener: -3388.93626891 hartree
oneelecener: -6032.05270330 hartree
twoeener: 2643.11643439 hartree
cpcmener: -0.02378844 hartree
kineticenergy: 1112.80688156 hartree
xcener: -110.226207554773 hartree
chargesum: -0.0000000
charge: -0.285053 -0.478138 -0.330931 0.170260 -0.040979 -0.093449 -0.293812 -0.292196 -0.283882 0.401574 -0.010760 -0.227108 -0.245691 0.077434 -0.016299 -0.163210 -0.224814 0.262269 -0.119153 -0.243280 0.301597 -0.254138 -0.211134 -0.119781 -0.139553 -0.194008 0.103673 0.090070 0.098217 0.091778 0.099813 0.104230 0.098188 0.082364 0.122973 0.088747 0.094215 0.094422 0.080915 0.100941 0.094804 0.114769 0.124706 0.141245 0.142607 0.157494 0.145941 0.144334 0.161978 0.156985 0.162027 0.156801
qa: -0.2851 -0.4781 -0.3309 0.1703 -0.0410 -0.0934 -0.2938 -0.2922 -0.2839 0.4016 -0.0108 -0.2271 -0.2457 0.0774 -0.0163 -0.1632 -0.2248 0.2623 -0.1192 -0.2433 0.3016 -0.2541 -0.2111 -0.1198 -0.1396 -0.1940 0.1037 0.0901 0.0982 0.0918 0.0998 0.1042 0.0982 0.0824 0.1230 0.0887 0.0942 0.0944 0.0809 0.1009 0.0948 0.1148 0.1247 0.1412 0.1426 0.1575 0.1459 0.1443 0.1620 0.1570 0.1620 0.1568
va: 2.1207 2.0233 2.0829 3.6896 3.8370 3.8022 3.9145 3.8885 3.8786 4.1529 3.7079 3.9296 3.9431 3.8149 3.6402 3.8767 3.9779 3.7437 3.8888 4.0223 3.7097 4.0067 3.8986 3.8890 3.8828 3.9340 1.0230 1.0334 1.0028 1.0016 0.9992 0.9954 1.0035 1.0154 1.0031 1.0068 0.9967 0.9957 1.0143 0.9983 0.9990 1.0116 0.9939 1.0225 1.0035 0.9888 1.0063 1.0090 0.9891 0.9887 0.9888 0.9916
dispcorr: -0.025825038 hartree
energy: -1117.894221496236
dipole: -30.37640 29.70060 -0.67579 -10.13509 9.03981 -1.09527 2.32750 -2.22532 0.10218
magnitude: 1.29103 au
magnitude: 3.28154 debye
