program: Orca
programVersion: 5.0.2
elementType: O O O C C C C C C C C C C C C C C C C C C C C C C C H H H H H H H H H H H H H H H H H H H H H H H H H H
charge: 0
multiplicity: 1
keywords: wb97x-d3
keywords: def2-TZVPP
keywords: def2/J RIJCOSX
keywords: DEFGRID2
keywords: scfconv7
keywords: smallprint printgap noloewdin
keywords: NOSOSCF
formula: C23H26O3
InChI: InChI=1/C23H26O3/c1-16(2)13-20-21(23(20,3)4)22(24)25-15-17-9-8-12-19(14-17)26-18-10-6-5-7-11-18/h5-14,20-21H,15H2,1-4H3
52 atoms
O  -0.573172 -1.571425 0.311064
O  -1.524535 -2.902041 1.829522
O  2.329401 3.032949 0.123962
C  -3.112377 -3.870857 -0.745777
C  -3.969597 -3.024279 0.130571
C  -2.601294 -2.514933 -0.276962
C  -3.429419 -3.961023 -2.219094
C  -2.5249 -5.144011 -0.189699
C  -5.196544 -2.343291 -0.3590
C  -1.541499 -2.378251 0.738975
C  -5.660102 -1.181819 0.110319
C  -6.925149 -0.574727 -0.414095
C  -4.971435 -0.394432 1.182095
C  0.53856 -1.339586 1.189256
C  1.509751 -0.483283 0.435659
C  1.533107 0.890511 0.637562
C  2.376598 -1.055664 -0.490456
C  2.409133 1.686852 -0.088369
C  3.246172 -0.252573 -1.211409
C  3.267951 1.122198 -1.022643
C  3.447803 3.81892 0.066788
C  3.313202 5.062035 -0.535196
C  4.655091 3.436078 0.639735
C  4.395141 5.930301 -0.560219
C  5.731826 4.309893 0.595625
C  5.609839 5.557306 -0.002177
H  -4.012285 -3.356936 1.165218
H  -2.582328 -1.750964 -1.046256
H  -2.537691 -4.235069 -2.786285
H  -3.80247 -3.022292 -2.628865
H  -4.184189 -4.728196 -2.405165
H  -3.202497 -5.977361 -0.386308
H  -2.360268 -5.107938 0.885015
H  -1.572103 -5.378302 -0.66905
H  -5.764606 -2.850801 -1.134081
H  -6.743241 0.42481 -0.818146
H  -7.663022 -0.454381 0.383645
H  -7.376853 -1.178648 -1.201147
H  -5.644063 -0.220824 2.02615
H  -4.684467 0.593599 0.811634
H  -4.075515 -0.878953 1.566666
H  0.995814 -2.290228 1.470502
H  0.198052 -0.842186 2.099503
H  0.867116 1.349274 1.35935
H  2.372314 -2.127414 -0.64727
H  3.916628 -0.696631 -1.935692
H  3.945832 1.7363 -1.601823
H  2.365573 5.348511 -0.973981
H  4.76102 2.472418 1.122187
H  4.286111 6.900443 -1.027641
H  6.672016 4.011351 1.041231
H  6.453846 6.23386 -0.028985
elementType: O C H
totalener: -1117.86981378 hartree
nucrepener: 2125.59882181 hartree
electener: -3243.46863559 hartree
oneelecener: -5740.55960264 hartree
twoeener: 2497.09096705 hartree
cpcmener: -0.02469832 hartree
kineticenergy: 1112.80190994 hartree
xcener: -110.222929810235 hartree
chargesum: 0.0000000
charge: -0.277078 -0.480785 -0.328154 0.147483 -0.020120 -0.095103 -0.286798 -0.276746 -0.291287 0.389630 -0.011963 -0.228271 -0.242333 0.081749 -0.017443 -0.222564 -0.203964 0.257589 -0.143137 -0.184058 0.281234 -0.245508 -0.190271 -0.123360 -0.146861 -0.184102 0.100909 0.091057 0.097309 0.092062 0.098199 0.095446 0.092223 0.098844 0.121842 0.094234 0.095592 0.088849 0.100094 0.097778 0.079994 0.114223 0.113161 0.133046 0.144777 0.159167 0.155730 0.145956 0.156968 0.157654 0.159135 0.157970
qa: -0.2771 -0.4808 -0.3282 0.1475 -0.0201 -0.0951 -0.2868 -0.2767 -0.2913 0.3896 -0.0120 -0.2283 -0.2423 0.0817 -0.0174 -0.2226 -0.2040 0.2576 -0.1431 -0.1841 0.2812 -0.2455 -0.1903 -0.1234 -0.1469 -0.1841 0.1009 0.0911 0.0973 0.0921 0.0982 0.0954 0.0922 0.0988 0.1218 0.0942 0.0956 0.0888 0.1001 0.0978 0.0800 0.1142 0.1132 0.1330 0.1448 0.1592 0.1557 0.1460 0.1570 0.1577 0.1591 0.1580
va: 2.1204 2.0210 2.0738 3.7134 3.8134 3.8287 3.9105 3.8893 3.8914 4.1402 3.7072 3.9300 3.9377 3.7992 3.7680 4.0340 3.9447 3.7571 3.9071 3.9131 3.6932 4.0063 3.9101 3.8875 3.8946 3.9039 1.0282 1.0315 1.0031 1.0019 0.9996 1.0013 1.0179 0.9994 1.0035 0.9964 0.9960 1.0066 0.9995 0.9985 1.0159 0.9987 1.0004 1.0181 1.0025 0.9908 0.9965 1.0080 0.9967 0.9893 0.9903 0.9905
dispcorr: -0.022510674 hartree
energy: -1117.892324453276
dipole: -27.50641 28.04429 0.53788 -15.08347 15.49924 0.41577 -5.14395 4.16797 -0.97598
magnitude: 1.18941 au
magnitude: 3.02325 debye
