program: Orca
programVersion: 5.0.2
elementType: O O O C C C C C C C C C C C C C C C C C C C C C C C H H H H H H H H H H H H H H H H H H H H H H H H H H
charge: 0
multiplicity: 1
keywords: wb97x-d3
keywords: def2-TZVPP
keywords: def2/J RIJCOSX
keywords: DEFGRID2
keywords: scfconv7
keywords: smallprint printgap noloewdin
keywords: NOSOSCF
formula: C23H26O3
InChI: InChI=1/C23H26O3/c1-16(2)13-20-21(23(20,3)4)22(24)25-15-17-9-8-12-19(14-17)26-18-10-6-5-7-11-18/h5-14,20-21H,15H2,1-4H3
52 atoms
O  0.703776 -2.297124 -1.264072
O  0.195787 -2.318131 0.912104
O  3.037616 2.073032 -0.157194
C  -2.742453 -2.325202 -0.247268
C  -2.392097 -0.947912 0.229177
C  -1.449919 -1.669953 -0.707473
C  -3.806086 -2.483838 -1.305406
C  -2.719874 -3.460088 0.745574
C  -3.094036 0.262288 -0.259812
C  -0.12956 -2.122689 -0.234115
C  -3.918605 1.029636 0.458904
C  -4.550051 2.250968 -0.137111
C  -4.280677 0.767393 1.888311
C  2.046447 -2.674596 -0.976109
C  2.83451 -1.579818 -0.310893
C  2.546497 -0.243893 -0.558085
C  3.89206 -1.910705 0.530006
C  3.291651 0.74743 0.066447
C  4.652273 -0.910799 1.117248
C  4.350619 0.425853 0.901571
C  1.746371 2.524426 -0.131443
C  1.411753 3.53545 -1.021508
C  0.809209 2.041784 0.775424
C  0.129601 4.066288 -1.002716
C  -0.47005 2.577377 0.777041
C  -0.819199 3.586652 -0.110782
H  -2.053264 -0.911309 1.260169
H  -1.459076 -1.333315 -1.738912
H  -3.769615 -1.698616 -2.059447
H  -4.800381 -2.4637 -0.854739
H  -3.696157 -3.440425 -1.819709
H  -2.0441 -3.289183 1.580286
H  -2.434897 -4.398936 0.266779
H  -3.719668 -3.597573 1.161808
H  -2.91003 0.542905 -1.293227
H  -5.641216 2.180346 -0.116932
H  -4.242534 2.412211 -1.170396
H  -4.291306 3.146089 0.435383
H  -5.36481 0.675727 1.996312
H  -3.98125 1.603465 2.526062
H  -3.834149 -0.138963 2.293352
H  2.477456 -2.911484 -1.949456
H  2.073885 -3.586755 -0.376247
H  1.738312 0.032192 -1.225188
H  4.117442 -2.950997 0.731459
H  5.47371 -1.172561 1.771522
H  4.925105 1.209891 1.378499
H  2.151979 3.904552 -1.72047
H  1.065615 1.258401 1.47773
H  -0.127045 4.855051 -1.698219
H  -1.196245 2.201651 1.485998
H  -1.819494 3.99939 -0.102817
elementType: O C H
totalener: -1117.86984706 hartree
nucrepener: 2330.57287082 hartree
electener: -3448.44271788 hartree
oneelecener: -6150.97652459 hartree
twoeener: 2702.53380671 hartree
cpcmener: -0.02579088 hartree
kineticenergy: 1112.81515374 hartree
xcener: -110.231110270358 hartree
chargesum: -0.0000000
charge: -0.294174 -0.462708 -0.333777 0.149207 -0.003813 -0.093624 -0.263575 -0.292014 -0.274080 0.380209 -0.040984 -0.251852 -0.255607 0.100074 0.033662 -0.214523 -0.224394 0.252712 -0.117416 -0.244097 0.291007 -0.250407 -0.183831 -0.120818 -0.157255 -0.193666 0.097182 0.088043 0.089740 0.095774 0.097571 0.093529 0.100314 0.094822 0.120944 0.106802 0.094936 0.092814 0.102681 0.094236 0.090507 0.122161 0.115055 0.143902 0.140358 0.156907 0.146030 0.144246 0.149874 0.156374 0.168632 0.162310
qa: -0.2942 -0.4627 -0.3338 0.1492 -0.0038 -0.0936 -0.2636 -0.2920 -0.2741 0.3802 -0.0410 -0.2519 -0.2556 0.1001 0.0337 -0.2145 -0.2244 0.2527 -0.1174 -0.2441 0.2910 -0.2504 -0.1838 -0.1208 -0.1573 -0.1937 0.0972 0.0880 0.0897 0.0958 0.0976 0.0935 0.1003 0.0948 0.1209 0.1068 0.0949 0.0928 0.1027 0.0942 0.0905 0.1222 0.1151 0.1439 0.1404 0.1569 0.1460 0.1442 0.1499 0.1564 0.1686 0.1623
va: 2.1143 2.0386 2.0739 3.7313 3.7352 3.8653 3.9072 3.9028 3.8217 4.1669 3.6862 3.9206 3.9442 3.7972 3.6108 3.9241 3.9736 3.7416 3.8928 4.0181 3.6838 4.0109 3.8746 3.9087 3.8605 3.8931 1.0249 1.0399 1.0030 1.0030 1.0033 1.0190 0.9995 1.0010 1.0095 0.9994 1.0060 0.9929 0.9982 0.9978 1.0082 0.9911 1.0094 1.0166 1.0026 0.9890 1.0056 1.0085 1.0054 0.9897 0.9772 0.9873
dispcorr: -0.027782871 hartree
energy: -1117.897629932494
dipole: -31.05922 30.14135 -0.91787 -3.48155 3.19797 -0.28358 2.09636 -2.74147 -0.64511
magnitude: 1.15718 au
magnitude: 2.94133 debye
