program: Orca
programVersion: 5.0.2
elementType: O O O C C C C C C C C C C C C C C C C C C C C C C C H H H H H H H H H H H H H H H H H H H H H H H H H H
charge: 0
multiplicity: 1
keywords: wb97x-d3
keywords: def2-TZVPP
keywords: def2/J RIJCOSX
keywords: DEFGRID2
keywords: scfconv7
keywords: smallprint printgap noloewdin
keywords: NOSOSCF
formula: C23H26O3
InChI: InChI=1/C23H26O3/c1-16(2)13-20-21(23(20,3)4)22(24)25-15-17-9-8-12-19(14-17)26-18-10-6-5-7-11-18/h5-14,20-21H,15H2,1-4H3
52 atoms
O  0.440167 -2.585731 -0.41838
O  -0.118585 -1.729496 1.574648
O  2.966102 2.038041 0.531594
C  -3.048776 -2.060923 0.649049
C  -2.589739 -0.702775 0.231692
C  -1.764343 -1.917658 -0.147418
C  -4.192593 -2.692197 -0.110882
C  -3.035577 -2.434246 2.111246
C  -3.336269 0.087379 -0.778708
C  -0.42384 -2.060939 0.45802
C  -2.878802 0.60073 -1.922462
C  -3.783949 1.383419 -2.82719
C  -1.470488 0.463535 -2.416079
C  1.812455 -2.698763 -0.027686
C  2.589085 -1.475856 -0.429406
C  2.436997 -0.289727 0.280511
C  3.443484 -1.511309 -1.525385
C  3.102132 0.85532 -0.133261
C  4.137324 -0.372064 -1.905397
C  3.961736 0.819827 -1.221961
C  1.722177 2.425456 0.943896
C  0.589732 2.222323 0.164192
C  1.625116 3.07398 2.165833
C  -0.64348 2.656091 0.623672
C  0.387202 3.515674 2.608109
C  -0.75209 3.302647 1.846624
H  -2.148897 -0.115488 1.035448
H  -1.826297 -2.238197 -1.180933
H  -4.135513 -3.780488 -0.054638
H  -4.198758 -2.410763 -1.16385
H  -5.151034 -2.390494 0.316462
H  -2.903443 -3.510296 2.238613
H  -3.994519 -2.167344 2.559887
H  -2.252387 -1.931905 2.671174
H  -4.376595 0.277741 -0.525348
H  -4.794779 1.463061 -2.429319
H  -3.847357 0.919035 -3.814533
H  -3.403012 2.395441 -2.984609
H  -1.049426 1.448384 -2.634641
H  -1.440446 -0.09425 -3.355692
H  -0.809107 -0.033366 -1.711323
H  2.188975 -3.576654 -0.552297
H  1.891414 -2.882002 1.044675
H  1.795331 -0.257228 1.151274
H  3.568832 -2.430811 -2.083506
H  4.808038 -0.406401 -2.753602
H  4.482524 1.718772 -1.524199
H  0.666557 1.726247 -0.794162
H  2.515207 3.227591 2.761571
H  -1.523958 2.482743 0.017253
H  0.314728 4.020528 3.562397
H  -1.716898 3.638296 2.201841
totalener: -1117.84606535 hartree
nucrepener: 2359.80342146 hartree
electener: -3477.64948681 hartree
oneelecener: -6208.35548507 hartree
twoeener: 2730.70599826 hartree
kineticenergy: 1112.85354625 hartree
xcener: -110.234120724698 hartree
chargesum: -0.0000000
charge: -0.264272 -0.406052 -0.303482 0.118178 -0.023403 -0.088354 -0.263830 -0.259862 -0.250830 0.334953 -0.000549 -0.210813 -0.258509 0.052145 0.000857 -0.189133 -0.188857 0.233963 -0.082732 -0.214342 0.249534 -0.164734 -0.215818 -0.109318 -0.075817 -0.161709 0.102584 0.099356 0.093238 0.084502 0.087532 0.082855 0.080274 0.105383 0.092143 0.079040 0.087588 0.087726 0.095237 0.108754 0.082898 0.095141 0.117585 0.166449 0.106582 0.124586 0.125614 0.128742 0.122495 0.142158 0.122907 0.121419
qa: -0.2643 -0.4061 -0.3035 0.1182 -0.0234 -0.0884 -0.2638 -0.2599 -0.2508 0.3350 -0.0005 -0.2108 -0.2585 0.0521 0.0009 -0.1891 -0.1889 0.2340 -0.0827 -0.2143 0.2495 -0.1647 -0.2158 -0.1093 -0.0758 -0.1617 0.1026 0.0994 0.0932 0.0845 0.0875 0.0829 0.0803 0.1054 0.0921 0.0790 0.0876 0.0877 0.0952 0.1088 0.0829 0.0951 0.1176 0.1664 0.1066 0.1246 0.1256 0.1287 0.1225 0.1422 0.1229 0.1214
va: 2.1218 2.0786 2.1140 3.7832 3.7906 3.8519 3.9073 3.9005 3.8486 4.1718 3.7283 3.9377 3.9264 3.8635 3.7153 3.8748 4.0287 3.8376 3.9359 4.0561 3.8623 3.9127 4.0494 3.8872 3.9255 4.0037 1.0216 1.0238 1.0057 1.0060 1.0039 1.0026 1.0015 1.0236 1.0143 1.0104 0.9996 0.9991 0.9946 1.0052 1.0067 0.9990 1.0132 1.0150 1.0125 0.9992 1.0125 1.0040 1.0141 0.9919 0.9982 1.0029
dispcorr: -0.028786185 hartree
energy: -1117.874851536344
dipole: -25.57866 25.11840 -0.46026 -4.42434 4.14609 -0.27826 -7.66138 6.91029 -0.75110
magnitude: 0.92380 au
magnitude: 2.34812 debye
