program: Gaussian 09
title: 000067677
version: EM64L-G09RevD.01
frameworkgroup: C1[X(C13H9ClF3NO)]
method: RPBEPBE
basis: SDD
operation: Freq
keyword: #p
keyword: freq=noraman
keyword: PBEPBE/SDD
title: #p freq=noraman PBEPBE/SDD
converged: YES YES NO NO
title: Mulliken charges:
elementType: Cl F F F O N C C C C C C C C C C C C C H H H H H H H H H
charge: -0.049791 -0.167845 -0.170745 -0.171873 -0.336562 -0.683590 0.201209 0.342878 0.321509 -0.512793 -0.309300 -0.383341 0.360230 0.247219 -0.340931 -0.374668 -0.183071 -0.175604 -0.122761 0.258608 0.269023 0.262542 0.277974 0.264293 0.315215 0.341673 0.260036 0.260465
chargesum: 0.00000
title: Mulliken charges with hydrogens summed into heavy atoms:
elementType: Cl F F F O N C C C C C C C C C C C C C
charge: -0.049791 -0.167845 -0.170745 -0.171873 -0.336562 -0.026702 0.201209 0.342878 0.321509 -0.254185 -0.040277 -0.120799 0.360230 0.247219 -0.062957 -0.110375 0.076965 0.084861 -0.122761
polarizability: 2.58535524e+02 -1.03369449e+01 1.52657480e+02 -1.11972228e+01 -1.75152429e+00 9.71399073e+01
1716.lowfreq: -0.0017 0.0005 0.0010 2.3609 3.9291 9.9724 19.1620 24.7438 34.1410
frequency: 19.0866 24.6416 34.1304 49.5358 95.3907 114.2223 163.5395 175.5120 192.5063 237.8650 261.4886 282.8627 313.1926 338.8536 359.6966 371.6585 398.1523 407.7697 414.8183 436.7603 468.2761 483.4102 491.3739 495.9760 533.8707 540.8941 597.7030 620.2508 632.2700 650.6999 678.1812 695.7161 722.7078 753.6273 805.6475 819.0627 830.6701 832.7480 870.6023 897.4986 934.8534 945.5514 960.2163 975.2126 994.6391 1010.0643 1019.0360 1069.1131 1075.8439 1103.4424 1132.1127 1162.2318 1180.4217 1207.3607 1252.6641 1280.5159 1288.1609 1330.2167 1367.7266 1398.6444 1416.2114 1456.3939 1467.5020 1511.6838 1587.2155 1592.2879 1606.0997 1612.1970 1640.3120 3154.6261 3156.9592 3159.1258 3162.4587 3176.8206 3181.8403 3182.1358 3564.1165 3709.8997
redmass: 10.8483 6.7507 9.2673 4.7806 9.5081 9.0446 9.0730 5.3844 8.0227 6.0762 6.2511 6.9937 8.2404 8.6878 4.4655 6.5990 1.5501 3.9618 3.0322 3.2663 4.7560 3.5719 3.3954 1.4014 5.6209 6.1254 9.3448 7.8649 6.4870 5.4598 9.1300 4.0641 4.2842 5.0108 1.3858 1.2638 1.9051 3.3462 1.5433 7.1908 1.3332 1.3226 1.3386 10.8308 4.0055 2.4874 4.5554 2.6782 2.1651 1.3013 2.0165 1.3817 1.5633 4.1782 2.4871 1.3835 1.3157 2.9659 6.7347 3.7834 8.2627 4.4842 2.3852 3.6600 7.3374 6.0371 6.6230 1.5881 2.9832 1.0919 1.0890 1.0885 1.0889 1.0971 1.0973 1.0971 1.0447 1.1045
irintensity: 0.4284 0.2315 0.1843 0.6920 0.7992 0.1545 1.4931 0.3292 0.2335 8.6482 15.2451 0.1676 5.7995 6.1239 29.3533 3.3873 127.1278 19.8044 0.7686 6.1392 21.9402 33.7426 21.0439 79.8637 7.5671 3.2885 20.0699 8.2086 16.2382 1.5401 8.9982 3.0333 2.4899 6.4427 55.0191 11.4408 33.2125 63.3824 55.1247 67.3914 1.0410 0.2977 0.3449 218.4177 60.5823 54.5445 190.5887 68.1610 60.0275 14.3880 97.6754 35.2977 26.6803 656.1824 86.1508 1.3813 0.2245 196.4146 0.6669 3.7795 21.8797 87.0044 253.7814 98.1029 4.2271 49.1670 12.2221 25.3436 257.5438 4.2649 8.0791 0.4030 2.6841 2.0535 0.6954 0.5532 87.3956 41.8514
temp: 298.150 k
press: 1.00000 atm
elementType: 17 9 9 9 8 7 6 6 6 6 6 6 6 6 6 6 6 6 6 1 1 1 1 1 1 1 1 1
symmnumber: 1
zpe: 503261.7 jmol-1
zpe.correction: 0.191682 hartree
zpe.thermalcorrener: 0.208625 hartree
zpe.thermalcorrenthalpy: 0.209569 hartree
zpe.thermalcorrgfe: 0.144354 hartree
zpe.sumelectzpe: -1389.002548 hartree
zpe.sumelectthermal: -1388.985606 hartree
zpe.sumelectthermalent: -1388.984661 hartree
zpe.sumelectthermalfe: -1389.049876 hartree
dipole: 2.6418 3.4204 0.3494
dipole: 4.3360
quadrupole: -144.2727 -103.1070 -115.0362
quadrupole: -6.3186 -4.8020 2.0370
quadrupole: -23.4674 17.6983 5.7691 -6.3186 -4.8020 2.0370
hfenergy: -1389.1942306 hartree
pointgroup: C01 [X(C13H9Cl1F3N1O1)]
dipole: 1.1244254 1.2771275 0.1213256 debye
polarizability: 256.7305495|-17.2195419|154.4044811|-11.2771474|-1.6674481|97.1978802 unknown
InChI: InChI=1S/C13H9ClF3NO/c14-9-2-4-10(5-3-9)19-12-6-1-8(7-11(12)18)13(15,16)17/h1-7H,18H2
charge 0 multiplicity 1
28 atoms
Cl 6.273904 -1.729705 0.29816
F  -4.599641 -1.584646 -0.961319
F  -4.501407 -1.313057 1.282578
F  -5.215752 0.392124 -0.022765
O  1.100274 1.314235 -0.272974
N  -0.83238 2.902759 0.712164
C  -0.19472 0.737126 -0.191422
C  -2.844279 -0.150537 -0.082562
C  -1.196855 1.62851 0.30631
C  -2.532665 1.154469 0.358287
C  -0.511879 -0.553363 -0.647985
C  -1.844891 -1.013113 -0.589622
C  2.268353 0.51859 -0.145036
C  -4.25223 -0.646763 0.041823
C  2.364564 -0.553455 0.772403
C  3.379132 0.918863 -0.918377
C  3.590755 -1.240674 0.905683
C  4.607068 0.235754 -0.781491
C  4.693592 -0.838349 0.126168
H  -3.325901 1.808797 0.733952
H  0.273749 -1.197558 -1.053722
H  -2.101936 -2.01317 -0.947376
H  1.504264 -0.845633 1.381597
H  3.27475 1.754636 -1.615887
H  -1.521567 3.558541 1.066067
H  0.139155 3.190225 0.628818
H  3.684167 -2.070185 1.612261
H  5.476277 0.532782 -1.374735
