program: Orca
programVersion: 5.0.2
elementType: O O O C C C C C C C C C C C C C C C C C C C C C C C H H H H H H H H H H H H H H H H H H H H H H H H H H
charge: 0
multiplicity: 1
keywords: wb97x-d3
keywords: def2-TZVPP
keywords: def2/J RIJCOSX
keywords: DEFGRID2
keywords: scfconv7
keywords: smallprint printgap noloewdin
keywords: NOSOSCF
formula: C23H26O3
InChI: InChI=1/C23H26O3/c1-16(2)13-20-21(23(20,3)4)22(24)25-15-17-9-8-12-19(14-17)26-18-10-6-5-7-11-18/h5-14,20-21H,15H2,1-4H3
52 atoms
O  -0.588679 -1.422236 -1.6341
O  -1.342551 0.080021 -0.157956
O  3.296336 1.730823 1.284261
C  -2.358888 -2.632776 1.157723
C  -3.487563 -1.789816 0.665065
C  -2.335034 -2.094148 -0.264045
C  -2.557416 -4.124384 1.28083
C  -1.421531 -2.067903 2.197442
C  -4.838023 -2.350791 0.402465
C  -1.397791 -1.017807 -0.646484
C  -5.691388 -1.895443 -0.515728
C  -7.049853 -2.503907 -0.691027
C  -5.375567 -0.754054 -1.433204
C  0.44223 -0.519893 -2.027363
C  1.577304 -0.516576 -1.042094
C  1.90175 0.637797 -0.346117
C  2.300379 -1.684781 -0.81566
C  2.964053 0.630453 0.550639
C  3.340799 -1.688838 0.09699
C  3.685744 -0.530231 0.777608
C  3.36672 2.955588 0.690089
C  3.01339 4.051736 1.465126
C  3.8213 3.132786 -0.611553
C  3.115912 5.327767 0.934768
C  3.910023 4.415117 -1.13129
C  3.558827 5.517188 -0.36616
H  -3.477214 -0.768899 1.039196
H  -2.510381 -2.835446 -1.035889
H  -1.598877 -4.642823 1.224612
H  -3.197165 -4.527405 0.495618
H  -3.011796 -4.376328 2.241509
H  -1.325016 -0.986369 2.136952
H  -0.422861 -2.497726 2.099453
H  -1.789898 -2.312082 3.195617
H  -5.156448 -3.174272 1.035404
H  -7.836605 -1.764788 -0.520622
H  -7.218019 -3.33541 -0.007684
H  -7.186102 -2.873096 -1.710714
H  -5.412638 -1.07447 -2.477717
H  -4.395353 -0.318796 -1.250975
H  -6.117963 0.041078 -1.328515
H  0.04653 0.487425 -2.171314
H  0.779318 -0.891763 -2.995635
H  1.31597 1.537121 -0.4912
H  2.045316 -2.591377 -1.350105
H  3.901696 -2.597077 0.273589
H  4.504882 -0.521141 1.484419
H  2.66325 3.896637 2.477101
H  4.109343 2.281842 -1.214917
H  2.838943 6.178601 1.543143
H  4.264988 4.550082 -2.144603
H  3.632954 6.514116 -0.778705
totalener: -1117.84684254 hartree
nucrepener: 2207.90153795 hartree
electener: -3325.74838049 hartree
oneelecener: -5904.72643440 hartree
twoeener: 2578.97805391 hartree
kineticenergy: 1112.85784325 hartree
xcener: -110.231294323251 hartree
chargesum: 0.0000000
charge: -0.265015 -0.386766 -0.300021 0.131968 -0.026545 -0.107325 -0.280541 -0.251553 -0.233922 0.343830 -0.005644 -0.211828 -0.226062 0.052825 0.002008 -0.111198 -0.211604 0.210705 -0.083699 -0.206428 0.253018 -0.214847 -0.162703 -0.087017 -0.118641 -0.149900 0.105840 0.081790 0.090753 0.083753 0.091439 0.098853 0.087377 0.083962 0.092696 0.086640 0.078347 0.083848 0.084749 0.081094 0.088760 0.101469 0.112357 0.121309 0.114932 0.124927 0.126046 0.124434 0.128456 0.124148 0.125174 0.123753
qa: -0.2650 -0.3868 -0.3000 0.1320 -0.0265 -0.1073 -0.2805 -0.2516 -0.2339 0.3438 -0.0056 -0.2118 -0.2261 0.0528 0.0020 -0.1112 -0.2116 0.2107 -0.0837 -0.2064 0.2530 -0.2148 -0.1627 -0.0870 -0.1186 -0.1499 0.1058 0.0818 0.0908 0.0838 0.0914 0.0989 0.0874 0.0840 0.0927 0.0866 0.0783 0.0838 0.0847 0.0811 0.0888 0.1015 0.1124 0.1213 0.1149 0.1249 0.1260 0.1244 0.1285 0.1241 0.1252 0.1238
va: 2.1240 2.1128 2.1078 3.7551 3.8320 3.8113 3.9086 3.8986 3.8992 4.2170 3.7310 3.9412 3.9415 3.8695 3.6687 3.8965 4.0062 3.8485 3.9213 4.0487 3.8151 4.0381 3.9291 3.9342 3.9523 3.9654 1.0265 1.0328 1.0064 1.0046 1.0006 1.0195 1.0027 1.0026 1.0089 0.9985 1.0097 0.9990 1.0006 1.0214 1.0017 1.0119 0.9907 1.0222 1.0154 0.9990 1.0120 1.0146 1.0066 0.9989 1.0002 1.0008
dispcorr: -0.024157619 hartree
energy: -1117.871000159130
dipole: -28.42598 28.30984 -0.11615 -15.25312 14.74701 -0.50611 0.08293 -0.62498 -0.54206
magnitude: 0.75064 au
magnitude: 1.90797 debye
