program: Orca
programVersion: 5.0.2
elementType: O O O C C C C C C C C C C C C C C C C C C C C C C C H H H H H H H H H H H H H H H H H H H H H H H H H H
charge: 0
multiplicity: 1
keywords: wb97x-d3
keywords: def2-TZVPP
keywords: def2/J RIJCOSX
keywords: DEFGRID2
keywords: scfconv7
keywords: smallprint printgap noloewdin
keywords: NOSOSCF
formula: C23H26O3
InChI: InChI=1/C23H26O3/c1-16(2)13-20-21(23(20,3)4)22(24)25-15-17-9-8-12-19(14-17)26-18-10-6-5-7-11-18/h5-14,20-21H,15H2,1-4H3
52 atoms
O  0.477467 -2.072576 1.146674
O  -0.297166 -2.478506 -0.919566
O  3.246942 1.693879 -0.852474
C  -2.113317 -0.009897 -0.124062
C  -2.904816 -1.283509 -0.139437
C  -1.617339 -1.229891 0.638552
C  -2.60133 1.138189 0.724397
C  -1.431536 0.438309 -1.392262
C  -4.194829 -1.420519 0.580196
C  -0.443108 -1.996577 0.170658
C  -5.398421 -1.285731 0.021799
C  -6.654621 -1.466008 0.818678
C  -5.602421 -0.953636 -1.424772
C  1.716935 -2.691506 0.858897
C  2.777576 -1.710894 0.427272
C  2.470546 -0.420575 0.021679
C  4.102041 -2.136597 0.418014
C  3.486464 0.434651 -0.390444
C  5.104768 -1.278994 -0.000937
C  4.807107 0.012739 -0.402435
C  2.186167 2.423053 -0.405297
C  1.870867 2.527247 0.9447
C  1.457632 3.128137 -1.352642
C  0.820259 3.342613 1.335491
C  0.417123 3.94965 -0.946556
C  0.090122 4.057717 0.396558
H  -2.825608 -1.84358 -1.066868
H  -1.697398 -1.150399 1.717685
H  -3.06299 0.806396 1.653703
H  -3.348312 1.720244 0.180933
H  -1.773801 1.80485 0.972709
H  -1.101893 -0.39014 -2.015121
H  -0.565724 1.066678 -1.172249
H  -2.124086 1.042642 -1.982099
H  -4.144271 -1.655386 1.639571
H  -6.447865 -1.693833 1.863657
H  -7.263556 -2.278032 0.413323
H  -7.274289 -0.566402 0.785832
H  -6.202665 -0.046735 -1.529138
H  -6.152402 -1.748603 -1.934254
H  -4.6698 -0.794158 -1.961767
H  1.596744 -3.464909 0.096519
H  2.026983 -3.179843 1.784289
H  1.44745 -0.070297 0.021639
H  4.350743 -3.141413 0.738133
H  6.13338 -1.614399 -0.00612
H  5.584792 0.691354 -0.726064
H  2.442815 1.982838 1.684902
H  1.716029 3.034004 -2.399047
H  0.577644 3.425215 2.386816
H  -0.145436 4.500593 -1.688531
H  -0.725142 4.695099 0.710822
totalener: -1117.84687048 hartree
nucrepener: 2302.37578248 hartree
electener: -3420.22265295 hartree
oneelecener: -6093.33540981 hartree
twoeener: 2673.11275686 hartree
kineticenergy: 1112.84995631 hartree
xcener: -110.235656887207 hartree
chargesum: -0.0000000
charge: -0.271388 -0.368139 -0.295700 0.155590 -0.020954 -0.123043 -0.243604 -0.250990 -0.196358 0.303947 -0.026450 -0.212929 -0.233739 0.048591 0.039900 -0.166366 -0.212151 0.289977 -0.075320 -0.227968 0.245560 -0.163452 -0.188393 -0.113205 -0.090774 -0.166800 0.103698 0.074292 0.081295 0.086227 0.086110 0.113686 0.036075 0.087203 0.086034 0.077697 0.086859 0.083122 0.083608 0.091898 0.080403 0.114460 0.108922 0.088797 0.106948 0.123051 0.123410 0.132308 0.123980 0.130617 0.124655 0.128803
qa: -0.2714 -0.3681 -0.2957 0.1556 -0.0210 -0.1230 -0.2436 -0.2510 -0.1964 0.3039 -0.0264 -0.2129 -0.2337 0.0486 0.0399 -0.1664 -0.2122 0.2900 -0.0753 -0.2280 0.2456 -0.1635 -0.1884 -0.1132 -0.0908 -0.1668 0.1037 0.0743 0.0813 0.0862 0.0861 0.1137 0.0361 0.0872 0.0860 0.0777 0.0869 0.0831 0.0836 0.0919 0.0804 0.1145 0.1089 0.0888 0.1069 0.1231 0.1234 0.1323 0.1240 0.1306 0.1247 0.1288
va: 2.1256 2.1297 2.1221 3.6570 3.8050 3.9252 3.9007 3.8852 3.8788 4.2740 3.7404 3.9413 3.9440 3.8827 3.7339 3.9563 4.0178 3.7610 3.9473 4.0385 3.7943 3.9284 3.9715 3.8803 3.8812 3.9075 1.0270 1.0393 1.0107 1.0062 1.0149 1.0219 1.0279 1.0061 1.0151 1.0109 0.9975 0.9987 1.0002 1.0008 1.0128 1.0101 0.9889 1.0119 1.0099 0.9996 1.0152 1.0027 1.0156 0.9990 0.9993 1.0003
dispcorr: -0.027664382 hartree
energy: -1117.874534858332
dipole: -31.59068 31.16574 -0.42494 1.13926 -0.77942 0.35983 0.18369 0.44871 0.63240
magnitude: 0.84260 au
magnitude: 2.14173 debye
