program: Orca
programVersion: 5.0.2
elementType: O O O C C C C C C C C C C C C C C C C C C C C C C C H H H H H H H H H H H H H H H H H H H H H H H H H H
charge: 0
multiplicity: 1
keywords: wb97x-d3
keywords: def2-TZVPP
keywords: def2/J RIJCOSX
keywords: DEFGRID2
keywords: scfconv7
keywords: smallprint printgap noloewdin
keywords: NOSOSCF
formula: C23H26O3
InChI: InChI=1/C23H26O3/c1-16(2)13-20-21(23(20,3)4)22(24)25-15-17-9-8-12-19(14-17)26-18-10-6-5-7-11-18/h5-14,20-21H,15H2,1-4H3
52 atoms
O  0.435199 -2.156084 0.891706
O  -0.343906 -2.213289 -1.21201
O  3.393352 1.726903 -0.637107
C  -2.154886 0.088378 -0.025763
C  -2.94475 -1.166748 -0.247302
C  -1.657787 -1.236275 0.531955
C  -2.651363 1.085633 0.99206
C  -1.461577 0.73544 -1.198794
C  -4.230853 -1.423753 0.442515
C  -0.486072 -1.918636 -0.055757
C  -5.438682 -1.334893 -0.116435
C  -6.68181 -1.639034 0.664048
C  -5.664894 -0.935475 -1.542745
C  1.658487 -2.760488 0.508991
C  2.767676 -1.761091 0.308151
C  2.513914 -0.438825 -0.029474
C  4.082382 -2.200528 0.4191
C  3.573377 0.431535 -0.255247
C  5.130754 -1.328262 0.176938
C  4.885978 -0.007174 -0.156653
C  2.287231 2.428212 -0.258974
C  1.657214 3.193625 -1.229899
C  1.833089 2.445676 1.054761
C  0.577128 3.990344 -0.881803
C  0.74542 3.238625 1.386528
C  0.112925 4.013464 0.424394
H  -2.863116 -1.571816 -1.251451
H  -1.73872 -1.333671 1.609498
H  -3.407001 1.735245 0.546429
H  -1.830518 1.715732 1.337943
H  -3.104108 0.611148 1.861875
H  -2.131639 1.460989 -1.66407
H  -1.164448 0.02152 -1.963346
H  -0.572473 1.281516 -0.876381
H  -4.17435 -1.713281 1.488109
H  -7.354716 -0.778145 0.68342
H  -6.461342 -1.916194 1.694175
H  -7.240613 -2.460644 0.2088
H  -4.745292 -0.694465 -2.071734
H  -6.313958 -0.05789 -1.596177
H  -6.172755 -1.729801 -2.095512
H  1.527315 -3.35085 -0.400705
H  1.922932 -3.445067 1.316552
H  1.49923 -0.07694 -0.124775
H  4.28921 -3.227823 0.69403
H  6.151842 -1.675947 0.260776
H  5.697782 0.682957 -0.343264
H  2.021984 3.165641 -2.248147
H  2.327812 1.853558 1.813907
H  0.091922 4.588788 -1.641452
H  0.396972 3.256794 2.410996
H  -0.732496 4.632204 0.692961
totalener: -1117.84722495 hartree
nucrepener: 2298.34262393 hartree
electener: -3416.18984888 hartree
oneelecener: -6085.26600204 hartree
twoeener: 2669.07615316 hartree
kineticenergy: 1112.84858040 hartree
xcener: -110.235541399328 hartree
chargesum: -0.0000000
charge: -0.268321 -0.370413 -0.296124 0.169312 -0.011739 -0.122880 -0.244405 -0.234061 -0.200595 0.300176 -0.026106 -0.213108 -0.235640 0.055280 0.027784 -0.155547 -0.197605 0.272904 -0.078298 -0.227820 0.238070 -0.174305 -0.153381 -0.101006 -0.136707 -0.146834 0.099358 0.071828 0.088026 0.085625 0.077940 0.088413 0.112777 0.015998 0.083112 0.083476 0.077455 0.086508 0.081852 0.083458 0.089579 0.112205 0.102947 0.099407 0.104872 0.123033 0.123453 0.123159 0.132981 0.123762 0.132993 0.127155
qa: -0.2683 -0.3704 -0.2961 0.1693 -0.0117 -0.1229 -0.2444 -0.2341 -0.2006 0.3002 -0.0261 -0.2131 -0.2356 0.0553 0.0278 -0.1555 -0.1976 0.2729 -0.0783 -0.2278 0.2381 -0.1743 -0.1534 -0.1010 -0.1367 -0.1468 0.0994 0.0718 0.0880 0.0856 0.0779 0.0884 0.1128 0.0160 0.0831 0.0835 0.0775 0.0865 0.0819 0.0835 0.0896 0.1122 0.1029 0.0994 0.1049 0.1230 0.1235 0.1232 0.1330 0.1238 0.1330 0.1272
va: 2.1263 2.1273 2.1194 3.6439 3.7956 3.9335 3.9008 3.8925 3.8944 4.2853 3.7503 3.9404 3.9476 3.8846 3.7474 3.9596 4.0054 3.7907 3.9562 4.0386 3.8194 3.9732 3.9216 3.9007 3.8869 3.8930 1.0293 1.0404 1.0059 1.0166 1.0117 1.0063 1.0222 1.0277 1.0163 0.9986 1.0112 0.9975 1.0122 0.9999 1.0003 1.0107 0.9919 0.9984 1.0113 0.9997 1.0154 1.0148 1.0028 1.0004 0.9984 1.0006
dispcorr: -0.027516037 hartree
energy: -1117.874740985838
dipole: -32.11834 31.67037 -0.44797 0.82269 -0.56885 0.25384 0.58850 0.04351 0.63201
magnitude: 0.81520 au
magnitude: 2.07207 debye
