program: Orca
programVersion: 5.0.2
elementType: O O O C C C C C C C C C C C C C C C C C C C C C C C H H H H H H H H H H H H H H H H H H H H H H H H H H
charge: 0
multiplicity: 1
keywords: wb97x-d3
keywords: def2-TZVPP
keywords: def2/J RIJCOSX
keywords: DEFGRID2
keywords: scfconv7
keywords: smallprint printgap noloewdin
keywords: NOSOSCF
formula: C23H26O3
InChI: InChI=1/C23H26O3/c1-16(2)13-20-21(23(20,3)4)22(24)25-15-17-9-8-12-19(14-17)26-18-10-6-5-7-11-18/h5-14,20-21H,15H2,1-4H3
52 atoms
O  0.311273 -1.986213 1.070032
O  -0.393065 -2.15238 -1.052944
O  3.366726 1.688355 -0.70972
C  -2.139877 0.309498 -0.060432
C  -2.977265 -0.916285 -0.269942
C  -1.725332 -1.007037 0.574398
C  -2.599863 1.387163 0.892477
C  -1.375369 0.862565 -1.23813
C  -4.2965 -1.106712 0.358251
C  -0.564918 -1.773611 0.073892
C  -5.374344 -1.670135 -0.19278
C  -6.651251 -1.798397 0.583703
C  -5.440502 -2.219556 -1.585685
C  1.516173 -2.664273 0.768769
C  2.640575 -1.742278 0.370567
C  2.430255 -0.409047 0.050577
C  3.926926 -2.268664 0.3114
C  3.505068 0.388532 -0.326524
C  4.989086 -1.466687 -0.069954
C  4.788814 -0.133384 -0.385766
C  2.330964 2.458423 -0.27394
C  1.692521 3.251489 -1.216992
C  1.957596 2.517854 1.063767
C  0.682684 4.113599 -0.818539
C  0.936769 3.374325 1.446135
C  0.295196 4.174886 0.511385
H  -2.857069 -1.359194 -1.252117
H  -1.86067 -1.054989 1.649419
H  -3.076956 0.992559 1.788581
H  -3.315662 2.04935 0.402165
H  -1.749674 1.992886 1.210329
H  -1.998415 1.581035 -1.773981
H  -1.072015 0.094713 -1.946161
H  -0.481071 1.395251 -0.908664
H  -4.390826 -0.756437 1.38196
H  -7.472221 -1.281745 0.079953
H  -6.564866 -1.387634 1.588988
H  -6.952421 -2.845216 0.674521
H  -6.215777 -1.709805 -2.162948
H  -5.712703 -3.277728 -1.568547
H  -4.508317 -2.13029 -2.138024
H  1.356543 -3.409153 -0.014777
H  1.78838 -3.194983 1.682647
H  1.437718 0.017587 0.089493
H  4.099389 -3.308311 0.563436
H  5.987947 -1.880052 -0.114865
H  5.613077 0.501254 -0.682301
H  1.995918 3.191868 -2.253858
H  2.462249 1.907475 1.801628
H  0.18987 4.73196 -1.55704
H  0.648575 3.421655 2.488172
H  -0.497454 4.843329 0.818965
totalener: -1117.84744843 hartree
nucrepener: 2297.27056493 hartree
electener: -3415.11801337 hartree
oneelecener: -6083.10602803 hartree
twoeener: 2667.98801467 hartree
kineticenergy: 1112.84488002 hartree
xcener: -110.236746534415 hartree
chargesum: -0.0000000
charge: -0.270977 -0.366723 -0.294847 0.117269 0.038695 -0.072612 -0.262266 -0.217059 -0.190725 0.289904 -0.052771 -0.203061 -0.237018 0.046579 0.033983 -0.173418 -0.213133 0.308004 -0.073114 -0.234690 0.254684 -0.180077 -0.170107 -0.096926 -0.126123 -0.155633 0.088340 0.069724 0.074848 0.094200 0.085260 0.090593 0.109254 0.015031 0.069352 0.082905 0.075319 0.084248 0.084755 0.085381 0.084920 0.113983 0.111219 0.088844 0.106958 0.122499 0.122919 0.122694 0.134443 0.124317 0.131853 0.128300
qa: -0.2710 -0.3667 -0.2948 0.1173 0.0387 -0.0726 -0.2623 -0.2171 -0.1907 0.2899 -0.0528 -0.2031 -0.2370 0.0466 0.0340 -0.1734 -0.2131 0.3080 -0.0731 -0.2347 0.2547 -0.1801 -0.1701 -0.0969 -0.1261 -0.1556 0.0883 0.0697 0.0748 0.0942 0.0853 0.0906 0.1093 0.0150 0.0694 0.0829 0.0753 0.0842 0.0848 0.0854 0.0849 0.1140 0.1112 0.0888 0.1070 0.1225 0.1229 0.1227 0.1344 0.1243 0.1319 0.1283
va: 2.1242 2.1308 2.1262 3.6871 3.8068 3.8433 3.9127 3.8913 3.9196 4.2880 3.8315 3.9342 3.9447 3.8815 3.7446 3.9587 4.0178 3.7504 3.9458 4.0392 3.7913 3.9693 3.9210 3.8901 3.8820 3.8985 1.0359 1.0381 1.0137 1.0035 1.0147 1.0051 1.0233 1.0289 1.0228 0.9981 1.0123 0.9982 0.9990 0.9991 1.0167 1.0090 0.9884 1.0102 1.0095 0.9997 1.0159 1.0155 1.0019 1.0000 0.9989 1.0002
dispcorr: -0.027097753 hartree
energy: -1117.874546187741
dipole: -31.16696 30.77408 -0.39289 -1.12904 1.34786 0.21882 0.15508 0.48482 0.63990
magnitude: 0.78212 au
magnitude: 1.98799 debye
