program: Orca
programVersion: 5.0.2
elementType: O O O C C C C C C C C C C C C C C C C C C C C C C C H H H H H H H H H H H H H H H H H H H H H H H H H H
charge: 0
multiplicity: 1
keywords: wb97x-d3
keywords: def2-TZVPP
keywords: def2/J RIJCOSX
keywords: DEFGRID2
keywords: scfconv7
keywords: smallprint printgap noloewdin
keywords: NOSOSCF
formula: C23H26O3
InChI: InChI=1/C23H26O3/c1-16(2)13-20-21(23(20,3)4)22(24)25-15-17-9-8-12-19(14-17)26-18-10-6-5-7-11-18/h5-14,20-21H,15H2,1-4H3
52 atoms
O  0.668499 -2.104064 -1.457026
O  0.131297 -2.923021 0.553499
O  2.681156 2.236569 0.387215
C  -2.810045 -2.570711 -0.458261
C  -2.421557 -1.399601 0.387072
C  -1.529892 -1.823962 -0.773805
C  -3.915255 -2.42547 -1.478624
C  -2.770316 -3.946186 0.163119
C  -3.126479 -0.105554 0.356532
C  -0.187669 -2.356257 -0.457867
C  -3.100386 0.837831 1.30298
C  -3.909825 2.09315 1.158648
C  -2.294605 0.764876 2.564879
C  2.044486 -2.370212 -1.19906
C  2.618446 -1.384415 -0.218874
C  2.387889 -0.026632 -0.411222
C  3.358737 -1.811786 0.872444
C  2.867525 0.893172 0.509592
C  3.870876 -0.881427 1.765094
C  3.619919 0.46875 1.598464
C  1.591177 2.746543 -0.256118
C  1.800719 3.8699 -1.044071
C  0.311078 2.225157 -0.103274
C  0.727835 4.473381 -1.681167
C  -0.749678 2.828246 -0.761383
C  -0.550423 3.952186 -1.549928
H  -2.010776 -1.682669 1.349815
H  -1.565388 -1.199339 -1.659224
H  -4.893479 -2.509393 -1.002019
H  -3.841415 -3.21569 -2.227305
H  -3.885111 -1.475751 -2.011063
H  -2.570847 -4.708891 -0.591973
H  -3.740405 -4.171211 0.609903
H  -2.015459 -4.039483 0.93898
H  -3.738737 0.08825 -0.519035
H  -4.456012 2.126034 0.216254
H  -3.276474 2.982123 1.21503
H  -4.63891 2.181008 1.968293
H  -1.700853 -0.14132 2.657365
H  -2.941756 0.831414 3.442595
H  -1.608148 1.613447 2.622041
H  2.527992 -2.27782 -2.172135
H  2.187609 -3.393363 -0.845889
H  1.818105 0.306781 -1.26957
H  3.518201 -2.869472 1.036948
H  4.449072 -1.213251 2.617187
H  3.996204 1.197825 2.303875
H  2.802503 4.265468 -1.148215
H  0.133416 1.352565 0.512641
H  0.897905 5.350471 -2.291486
H  -1.738233 2.403289 -0.650142
H  -1.3848 4.417581 -2.057041
totalener: -1117.84751496 hartree
nucrepener: 2338.34193836 hartree
electener: -3456.18945332 hartree
oneelecener: -6165.32481179 hartree
twoeener: 2709.13535847 hartree
kineticenergy: 1112.85634421 hartree
xcener: -110.236239200725 hartree
chargesum: -0.0000000
charge: -0.273075 -0.383307 -0.298212 0.087593 0.046108 -0.064006 -0.268619 -0.253862 -0.188244 0.322715 -0.088631 -0.223936 -0.257924 0.068750 0.044548 -0.276549 -0.158775 0.297963 -0.072016 -0.238114 0.296611 -0.230435 -0.227230 -0.071700 -0.086429 -0.179002 0.095446 0.076007 0.098743 0.091286 0.073644 0.083179 0.084660 0.101041 0.081839 0.082728 0.086714 0.097049 0.094410 0.098021 0.086531 0.108757 0.098716 0.131254 0.103666 0.123486 0.123110 0.123020 0.147678 0.123962 0.139633 0.121197
qa: -0.2731 -0.3833 -0.2982 0.0876 0.0461 -0.0640 -0.2686 -0.2539 -0.1882 0.3227 -0.0886 -0.2239 -0.2579 0.0687 0.0445 -0.2765 -0.1588 0.2980 -0.0720 -0.2381 0.2966 -0.2304 -0.2272 -0.0717 -0.0864 -0.1790 0.0954 0.0760 0.0987 0.0913 0.0736 0.0832 0.0847 0.1010 0.0818 0.0827 0.0867 0.0970 0.0944 0.0980 0.0865 0.1088 0.0987 0.1313 0.1037 0.1235 0.1231 0.1230 0.1477 0.1240 0.1396 0.1212
va: 2.1137 2.1194 2.1255 3.8099 3.7543 3.7961 3.9157 3.9048 3.8518 4.2438 3.7849 3.9194 3.9332 3.8668 3.6936 3.9480 4.0171 3.7827 3.9311 4.0520 3.8052 4.0522 3.9587 3.9166 3.8614 4.0241 1.0265 1.0362 1.0012 1.0049 1.0089 1.0030 1.0004 1.0235 1.0193 1.0084 0.9984 1.0016 1.0134 1.0018 0.9983 0.9896 1.0109 1.0176 1.0144 0.9991 1.0143 1.0152 0.9861 0.9983 0.9980 1.0042
dispcorr: -0.027478058 hartree
energy: -1117.874993020584
dipole: -26.03612 25.53321 -0.50291 -3.60278 3.75163 0.14886 2.97297 -3.37875 -0.40578
magnitude: 0.66312 au
magnitude: 1.68552 debye
