program: Orca
programVersion: 5.0.2
elementType: O O O C C C C C C C C C C C C C C C C C C C C C C C H H H H H H H H H H H H H H H H H H H H H H H H H H
charge: 0
multiplicity: 1
keywords: wb97x-d3
keywords: def2-TZVPP
keywords: def2/J RIJCOSX
keywords: DEFGRID2
keywords: scfconv7
keywords: smallprint printgap noloewdin
keywords: NOSOSCF
formula: C23H26O3
InChI: InChI=1/C23H26O3/c1-16(2)13-20-21(23(20,3)4)22(24)25-15-17-9-8-12-19(14-17)26-18-10-6-5-7-11-18/h5-14,20-21H,15H2,1-4H3
52 atoms
O  0.040454 -2.36316 0.188773
O  -1.130316 -0.874339 1.37839
O  2.190625 3.175046 -0.063105
C  -3.458428 -2.957092 1.070207
C  -3.592461 -1.903499 0.026453
C  -2.26259 -2.623009 0.19681
C  -4.070154 -4.316014 0.820979
C  -3.489518 -2.550358 2.523198
C  -4.387152 -2.089046 -1.212728
C  -1.100737 -1.849387 0.675765
C  -4.193428 -1.417353 -2.348917
C  -5.062431 -1.647447 -3.547875
C  -3.112591 -0.39493 -2.528237
C  1.223324 -1.611909 0.425285
C  1.271119 -0.354327 -0.400071
C  1.715166 0.828223 0.170558
C  0.891705 -0.371994 -1.73925
C  1.799092 1.98307 -0.597802
C  0.954983 0.790346 -2.489564
C  1.417094 1.971669 -1.929491
C  3.276893 3.225039 0.759675
C  3.224334 4.110191 1.82709
C  4.422324 2.473337 0.525024
C  4.32568 4.247469 2.657324
C  5.512633 2.61476 1.369083
C  5.472507 3.499481 2.436631
H  -3.573966 -0.889333 0.417125
H  -2.026115 -3.363063 -0.558748
H  -3.996652 -4.625036 -0.221598
H  -5.126839 -4.319995 1.096052
H  -3.570162 -5.07514 1.424441
H  -3.073354 -1.561056 2.693244
H  -2.933266 -3.259662 3.138949
H  -4.521612 -2.5452 2.878678
H  -5.199647 -2.808621 -1.174192
H  -5.569062 -0.727065 -3.848856
H  -5.824644 -2.403599 -3.363615
H  -4.468589 -1.970102 -4.406863
H  -2.452085 -0.673434 -3.353707
H  -2.494098 -0.25739 -1.643743
H  -3.53889 0.576454 -2.790837
H  2.036054 -2.282558 0.142017
H  1.336352 -1.379171 1.486455
H  1.978845 0.855773 1.221081
H  0.5375 -1.288012 -2.194251
H  0.65228 0.777848 -3.528391
H  1.475956 2.881515 -2.511781
H  2.324928 4.687493 1.996096
H  4.467693 1.788572 -0.311985
H  4.281329 4.940151 3.487401
H  6.404148 2.030572 1.182571
H  6.328133 3.606229 3.089338
totalener: -1117.84623134 hartree
nucrepener: 2217.25096444 hartree
electener: -3335.09719577 hartree
oneelecener: -5923.31873211 hartree
twoeener: 2588.22153634 hartree
kineticenergy: 1112.85767265 hartree
xcener: -110.232126038920 hartree
chargesum: 0.0000000
charge: -0.272657 -0.379593 -0.300284 0.138861 -0.038596 -0.074384 -0.279824 -0.255603 -0.232499 0.306811 0.008921 -0.212013 -0.239478 0.071827 0.070123 -0.141462 -0.258384 0.206868 -0.069165 -0.207733 0.233421 -0.207054 -0.151004 -0.091623 -0.121335 -0.145897 0.106272 0.080022 0.081118 0.093203 0.091548 0.103221 0.083614 0.082695 0.093673 0.086726 0.077968 0.084135 0.077774 0.088410 0.092146 0.105591 0.099389 0.114390 0.121319 0.122914 0.125253 0.126073 0.129643 0.124797 0.125603 0.124258
qa: -0.2727 -0.3796 -0.3003 0.1389 -0.0386 -0.0744 -0.2798 -0.2556 -0.2325 0.3068 0.0089 -0.2120 -0.2395 0.0718 0.0701 -0.1415 -0.2584 0.2069 -0.0692 -0.2077 0.2334 -0.2071 -0.1510 -0.0916 -0.1213 -0.1459 0.1063 0.0800 0.0811 0.0932 0.0915 0.1032 0.0836 0.0827 0.0937 0.0867 0.0780 0.0841 0.0778 0.0884 0.0921 0.1056 0.0994 0.1144 0.1213 0.1229 0.1253 0.1261 0.1296 0.1248 0.1256 0.1243
va: 2.1136 2.1182 2.1049 3.7500 3.8426 3.7967 3.9131 3.8925 3.8997 4.2248 3.7273 3.9404 3.9544 3.8677 3.6429 3.9647 3.9855 3.8542 3.8975 4.0552 3.8272 4.0324 3.9272 3.9353 3.9538 3.9606 1.0240 1.0343 1.0044 1.0001 1.0067 1.0227 1.0026 1.0017 1.0094 0.9985 1.0102 0.9987 1.0007 1.0108 1.0021 0.9875 1.0125 1.0155 1.0163 0.9993 1.0118 1.0140 1.0059 0.9989 1.0002 1.0006
dispcorr: -0.024765962 hartree
energy: -1117.870997299749
dipole: -24.90157 25.03125 0.12968 -16.31966 15.68503 -0.63463 -5.46667 5.05985 -0.40682
magnitude: 0.76490 au
magnitude: 1.94421 debye
