program: Orca
programVersion: 5.0.2
elementType: O O O C C C C C C C C C C C C C C C C C C C C C C C H H H H H H H H H H H H H H H H H H H H H H H H H H
charge: 0
multiplicity: 1
keywords: wb97x-d3
keywords: def2-TZVPP
keywords: def2/J RIJCOSX
keywords: DEFGRID2
keywords: scfconv7
keywords: smallprint printgap noloewdin
keywords: NOSOSCF
formula: C23H26O3
InChI: InChI=1/C23H26O3/c1-16(2)13-20-21(23(20,3)4)22(24)25-15-17-9-8-12-19(14-17)26-18-10-6-5-7-11-18/h5-14,20-21H,15H2,1-4H3
52 atoms
O  0.683889 -2.236878 -1.329881
O  0.114722 -2.632468 0.795527
O  3.052928 2.13272 -0.113593
C  -2.801832 -2.497805 -0.360285
C  -2.452683 -1.190387 0.285076
C  -1.51589 -1.790112 -0.743139
C  -3.87804 -2.533184 -1.418605
C  -2.774909 -3.744168 0.490986
C  -3.152766 0.071902 -0.023876
C  -0.184808 -2.265861 -0.308828
C  -3.740134 0.891383 0.851723
C  -4.387784 2.165117 0.394677
C  -3.809318 0.64944 2.328987
C  2.031531 -2.580334 -1.032579
C  2.735314 -1.513175 -0.240181
C  2.5462 -0.174378 -0.557428
C  3.60028 -1.859542 0.789149
C  3.201145 0.807335 0.172774
C  4.277832 -0.873441 1.488576
C  4.075192 0.464858 1.193698
C  1.809164 2.660233 -0.298985
C  1.726018 3.779516 -1.117364
C  0.671081 2.159045 0.322317
C  0.501836 4.398051 -1.312051
C  -0.548756 2.782992 0.108729
C  -0.642907 3.901028 -0.705778
H  -2.09042 -1.291071 1.302665
H  -1.523551 -1.327942 -1.72443
H  -3.868858 -1.657505 -2.066236
H  -4.864702 -2.58679 -0.95524
H  -3.759738 -3.412813 -2.053516
H  -2.563119 -4.62679 -0.115721
H  -3.75322 -3.890348 0.952483
H  -2.033969 -3.698588 1.284674
H  -3.173851 0.363081 -1.070143
H  -4.297408 2.308445 -0.681548
H  -3.939727 3.033065 0.886982
H  -5.450629 2.182279 0.648739
H  -3.34198 -0.281426 2.641138
H  -4.849518 0.620851 2.66275
H  -3.33126 1.464488 2.878555
H  2.503997 -2.703751 -2.00823
H  2.084006 -3.538583 -0.510894
H  1.877365 0.108264 -1.361404
H  3.733383 -2.900655 1.054186
H  4.950866 -1.146523 2.29032
H  4.582552 1.243026 1.748236
H  2.621653 4.158999 -1.591505
H  0.724824 1.291137 0.966578
H  0.444166 5.271156 -1.948748
H  -1.433119 2.375478 0.57975
H  -1.599491 4.380556 -0.86452
totalener: -1117.84795450 hartree
nucrepener: 2315.56641392 hartree
electener: -3433.41436842 hartree
oneelecener: -6119.80923179 hartree
twoeener: 2686.39486337 hartree
kineticenergy: 1112.86003821 hartree
xcener: -110.235737071013 hartree
chargesum: 0.0000000
charge: -0.276116 -0.379617 -0.301321 0.099688 0.059451 -0.097205 -0.236627 -0.263892 -0.227596 0.327039 -0.055630 -0.221078 -0.234486 0.071975 0.068153 -0.245613 -0.164812 0.248483 -0.086655 -0.211799 0.288554 -0.236742 -0.221306 -0.059187 -0.044746 -0.213191 0.093230 0.071776 0.071712 0.091009 0.091220 0.084567 0.084534 0.101850 0.079574 0.084678 0.078603 0.098945 0.084745 0.090524 0.086163 0.107320 0.099124 0.130077 0.103988 0.123406 0.124122 0.121931 0.133295 0.122607 0.136810 0.118466
qa: -0.2761 -0.3796 -0.3013 0.0997 0.0595 -0.0972 -0.2366 -0.2639 -0.2276 0.3270 -0.0556 -0.2211 -0.2345 0.0720 0.0682 -0.2456 -0.1648 0.2485 -0.0867 -0.2118 0.2886 -0.2367 -0.2213 -0.0592 -0.0447 -0.2132 0.0932 0.0718 0.0717 0.0910 0.0912 0.0846 0.0845 0.1019 0.0796 0.0847 0.0786 0.0989 0.0847 0.0905 0.0862 0.1073 0.0991 0.1301 0.1040 0.1234 0.1241 0.1219 0.1333 0.1226 0.1368 0.1185
va: 2.1177 2.1187 2.1130 3.7660 3.7297 3.8851 3.9120 3.9117 3.8653 4.2219 3.8083 3.9254 3.9450 3.8619 3.6536 3.9633 4.0218 3.8127 3.9401 4.0571 3.7829 4.0520 3.9773 3.9211 3.8509 4.0073 1.0330 1.0405 1.0102 1.0048 1.0050 1.0031 1.0012 1.0227 1.0196 1.0094 0.9959 1.0009 1.0144 0.9993 0.9985 0.9879 1.0113 1.0192 1.0128 0.9998 1.0123 1.0155 1.0117 0.9987 0.9810 1.0053
dispcorr: -0.026753544 hartree
energy: -1117.874708043563
dipole: -30.04433 29.43121 -0.61312 -3.79236 3.66350 -0.12886 3.01151 -3.34803 -0.33652
magnitude: 0.71117 au
magnitude: 1.80765 debye
