program: Gaussian 09
title: 000004874
version: EM64L-G09RevD.01
frameworkgroup: C1[X(C7H8O5S)]
method: RPBEPBE
basis: SDD
operation: Freq
keyword: #pfreq=noraman
keyword: PBEPBE/SDD
title: #p freq=noraman PBEPBE/SDD
converged: YES YES NO NO
title: Mulliken charges:
elementType: S O O O O O C C C C C C C H H H H H H H H
charge: 0.987358 -0.323370 -0.568954 -0.410943 -0.511509 -0.504102 -0.084930 -0.303761 0.273374 -0.225929 0.144929 -0.293931 -0.523676 0.297722 0.283290 0.269264 0.249845 0.237570 0.238527 0.380827 0.388397
chargesum: 0.00000
title: Mulliken charges with hydrogens summed into heavy atoms:
elementType: S O O O O O C C C C C C C
charge: 0.987358 -0.323370 -0.188126 -0.022546 -0.511509 -0.504102 -0.084930 -0.006039 0.273374 0.057361 0.144929 -0.024667 0.202267
polarizability: 1.66715360e+02 1.26611568e+00 1.28036124e+02 5.49169668e-01 1.27387653e-01 7.06726050e+01
1716.lowfreq: -6.2888 -0.0016 0.0014 0.0019 5.5745 6.4445 28.9444 81.6047 93.9033
frequency: 28.9355 81.5993 93.8983 109.2184 164.9635 167.5846 191.4956 193.9944 232.0739 257.9241 271.1723 310.9465 314.2713 368.2717 370.8377 416.4682 449.6484 508.0700 526.2854 532.8538 534.9326 591.3184 623.3093 727.6795 761.0431 816.6066 823.9454 841.0125 864.4235 948.9372 966.1747 988.7040 1047.8668 1060.1634 1111.9899 1117.4097 1153.6909 1184.5978 1193.1945 1247.3625 1305.2879 1415.6445 1428.1209 1443.1051 1467.5604 1472.0194 1495.9160 1585.6704 1620.0297 2978.3450 3073.7386 3140.2525 3167.2082 3167.8539 3187.4301 3478.1185 3504.1357
redmass: 6.5656 6.3647 3.5260 5.8991 2.2726 3.6646 2.6288 1.4989 6.6152 2.8913 3.2546 5.5851 7.1873 6.5851 7.3409 11.4733 3.2073 6.5765 1.0943 6.3745 5.9936 5.3258 7.7584 3.6791 5.4614 8.4482 1.4304 9.4225 1.4236 1.3585 15.8143 8.0842 1.2213 1.9148 1.6916 1.2551 1.3252 1.4334 2.9405 1.7928 1.8353 3.5612 2.8481 1.4305 1.0482 1.0966 3.1257 7.5519 6.8947 1.0321 1.1052 1.1011 1.0912 1.0903 1.0971 1.0661 1.0646
irintensity: 2.1530 0.9740 6.0218 2.5997 20.5443 13.2092 19.9051 10.9467 7.0695 3.3127 42.2439 25.0602 11.0133 9.0846 3.7278 81.7414 2.9625 7.7078 156.4308 92.7006 53.8106 57.0837 28.4820 0.1540 22.5005 29.3928 31.6839 51.4650 36.3888 1.1649 84.1010 65.1040 57.6265 88.7309 26.5516 0.0887 18.1146 169.4401 131.3018 80.7042 57.4975 17.6612 86.1172 5.8241 17.4148 70.5868 129.1147 60.1279 10.7943 39.6003 32.3529 16.4610 3.7804 3.4769 3.5148 40.0391 110.7013
temp: 298.150 k
press: 1.00000 atm
elementType: 16 8 8 8 8 8 6 6 6 6 6 6 6 1 1 1 1 1 1 1 1
symmnumber: 1
zpe: 377573.2 jmol-1
zpe.correction: 0.143810 hartree
zpe.thermalcorrener: 0.157582 hartree
zpe.thermalcorrenthalpy: 0.158526 hartree
zpe.thermalcorrgfe: 0.103038 hartree
zpe.sumelectzpe: -1044.547354 hartree
zpe.sumelectthermal: -1044.533582 hartree
zpe.sumelectthermalent: -1044.532638 hartree
zpe.sumelectthermalfe: -1044.588126 hartree
dipole: 4.2413 2.0388 1.3808
dipole: 4.9043
quadrupole: -82.1297 -77.4868 -88.0310
quadrupole: 9.7193 -8.4511 1.5710
quadrupole: 0.4195 5.0624 -5.4818 9.7193 -8.4511 1.5710
hfenergy: -1044.691164 hartree
pointgroup: C01 [X(C7H8O5S1)]
dipole: -1.7262672 -0.7438554 0.4355178 debye
dipolederiv: 2.1165998 -0.2679248 0.0679159 -0.3593669 1.3091672 -0.0591291 0.2221014 -0.1061013 1.6242211 -0.9896135 -0.6038608 -0.0769287 -0.6620183 -1.0941489 -0.097249 -0.063727 -0.0941948 -0.3092593 -0.5771317 0.0218244 -0.2444771 0.0504317 -0.5716673 0.1146721 -0.3551664 0.1417903 -0.9606309 -1.4940544 0.4110345 0.0539448 0.3645449 -0.2572553 0.0145169 0.0570046 0.0118497 -0.3967826 -0.6670362 0.0549204 -0.0170489 0.1311439 -0.6432654 -0.1322034 -0.0002629 -0.0456309 -0.5287152 -0.7765805 -0.0249408 0.0643108 -0.0459794 -0.5495103 0.1000901 0.0028935 0.0320198 -0.5027996 -0.3280931 0.1423838 0.028615 0.0322103 -0.1208468 0.0014731 0.1764117 -0.0494055 -0.1781141 -0.0589376 -0.2598216 -0.0380468 0.2921233 -0.1339454 -0.0005859 0.0186416 0.0215477 -0.109119 0.6372713 0.8104072 0.0994037 0.9207817 0.3564202 0.0353549 0.0859924 0.0310185 0.0698025 -0.0726236 -0.0435996 -0.0097342 -0.2305511 0.0553141 0.0200678 -0.0536342 0.0096674 -0.0959111 1.3648958 -0.4317368 -0.0621313 -0.6004395 0.0710546 -0.0009923 -0.0888275 0.0028148 0.0835233 -0.30342 0.1363257 0.0123613 -0.1058307 0.1009216 0.0329316 -0.0207226 0.0348864 -0.1485339 0.2088171 -0.0019347 0.0018135 0.3449918 0.799208 0.0600331 0.0422533 0.0586508 0.3170494 0.1760261 0.0249334 0.0107538 -0.0184471 0.0410471 -0.0155106 0.0008683 -0.0264654 0.1591323 0.0751878 -0.0617154 -0.0006798 -0.0370341 0.1092404 -0.0104727 0.0036289 0.0019721 0.1615901 0.0582942 0.0386531 0.0059925 0.0344093 -0.013883 -0.0220813 0.012946 -0.0247881 0.174473 -0.0873409 -0.1054608 -0.0113595 -0.0612431 0.0424315 -0.010397 -0.0050782 -0.0094264 0.129504 0.0677852 0.1174429 -0.0968904 -0.038505 -0.0348719 0.0195528 -0.0788869 0.065305 -0.0545728 0.073054 0.0888453 0.1208753 -0.0571656 -0.0144647 -0.0090451 0.0637279 -0.0556965 -0.0746432 0.1108041 0.0653659 0.1037034 0.0762745 0.3263243 -0.0225387 -0.0139861 0.017518 0.2573547 0.466096 -0.1111412 -0.0123931 -0.0303304 0.22273 -0.0184872 -0.0061779 -0.0173315 0.3824314 unknown
polarizability: 166.7074742|-1.3931054|127.3334727|0.7766911|6.3199278|71.3831421 unknown
InChI: InChI=1S/C7H8O5S/c1-12-7-4-5(13(9,10)11)2-3-6(7)8/h2-4,8-9H,1H3
charge 0 multiplicity 1
21 atoms
S  2.392586 -0.367814 -0.248004
O  -2.880599 -0.89837 -0.220133
O  2.658675 -0.62644 1.577932
O  -3.232346 1.724063 0.107953
O  2.380197 -1.81979 -0.965998
O  3.411019 0.788656 -0.74175
C  0.658926 0.286148 -0.122016
C  -0.387662 -0.652355 -0.217671
C  -1.696462 -0.150637 -0.141727
C  0.474679 1.666128 0.048393
C  -1.929851 1.24987 0.033936
C  -0.850583 2.149103 0.122371
C  -2.760389 -2.35065 -0.403828
H  -0.164198 -1.712775 -0.364908
H  1.331972 2.3426 0.103742
H  -1.061049 3.213812 0.250816
H  -3.7925 -2.726419 -0.438755
H  -2.220279 -2.807609 0.446017
H  -2.241381 -2.581883 -1.352461
H  3.605899 -0.928911 1.69948
H  -3.860852 0.957172 0.022712
