program: Orca
programVersion: 5.0.2
elementType: O O O C C C C C C C C C C C C C C C C C C C C C C C H H H H H H H H H H H H H H H H H H H H H H H H H H
charge: 0
multiplicity: 1
keywords: wb97x-d3
keywords: def2-TZVPP
keywords: def2/J RIJCOSX
keywords: DEFGRID2
keywords: scfconv7
keywords: smallprint printgap noloewdin
keywords: NOSOSCF
formula: C23H26O3
InChI: InChI=1/C23H26O3/c1-16(2)13-20-21(23(20,3)4)22(24)25-15-17-9-8-12-19(14-17)26-18-10-6-5-7-11-18/h5-14,20-21H,15H2,1-4H3
52 atoms
O  0.412189 -2.769864 0.253417
O  -0.322124 -0.87036 1.176325
O  3.330242 2.22831 -0.211318
C  -3.13985 -2.182552 0.97698
C  -2.917285 -1.37752 -0.263882
C  -1.872125 -2.396482 0.175742
C  -4.120544 -3.332108 0.96136
C  -3.112313 -1.468069 2.307038
C  -3.665125 -1.591618 -1.514439
C  -0.546964 -1.904689 0.603308
C  -3.865178 -0.703224 -2.491333
C  -4.665498 -1.07088 -3.705656
C  -3.338619 0.699943 -2.49575
C  1.760514 -2.37151 0.499056
C  2.185093 -1.246825 -0.403345
C  2.577192 -0.03284 0.138598
C  2.16103 -1.409866 -1.784884
C  2.921025 1.022596 -0.695717
C  2.52218 -0.358024 -2.610013
C  2.894051 0.865102 -2.072917
C  2.682002 2.827082 0.828621
C  1.341905 2.607951 1.126318
C  3.427138 3.731415 1.575122
C  0.761475 3.29637 2.181285
C  2.828882 4.418643 2.618103
C  1.494544 4.202998 2.931099
H  -2.61561 -0.355109 -0.066229
H  -1.840606 -3.31545 -0.398371
H  -5.142752 -2.967385 1.076595
H  -3.913778 -4.012359 1.789027
H  -4.080196 -3.920211 0.045419
H  -2.449684 -0.607366 2.31506
H  -2.794723 -2.142184 3.104766
H  -4.118312 -1.1214 2.551126
H  -4.092293 -2.580076 -1.651622
H  -5.522299 -0.40373 -3.829592
H  -5.042867 -2.091709 -3.656365
H  -4.065884 -0.978332 -4.614786
H  -2.712872 0.937322 -1.638833
H  -4.159578 1.420895 -2.519414
H  -2.742506 0.879778 -3.393424
H  2.347506 -3.26931 0.304166
H  1.897897 -2.099297 1.54776
H  2.58312 0.096921 1.213529
H  1.852534 -2.353955 -2.215988
H  2.503254 -0.483085 -3.684529
H  3.163238 1.696061 -2.711409
H  0.749896 1.900822 0.560841
H  4.468567 3.89278 1.32921
H  -0.279565 3.114788 2.41347
H  3.415087 5.123277 3.193229
H  1.03197 4.735835 3.750685
totalener: -1117.84739670 hartree
nucrepener: 2256.60413416 hartree
electener: -3374.45153086 hartree
oneelecener: -6002.09751232 hartree
twoeener: 2627.64598146 hartree
kineticenergy: 1112.86160195 hartree
xcener: -110.234836243689 hartree
chargesum: -0.0000000
charge: -0.270717 -0.405366 -0.299569 0.097741 0.014501 -0.075812 -0.266593 -0.251763 -0.180279 0.362196 -0.043380 -0.207635 -0.237916 0.065508 0.019761 -0.168259 -0.215010 0.251949 -0.074443 -0.217669 0.283443 -0.175661 -0.233661 -0.115609 -0.082393 -0.154531 0.088816 0.072156 0.097139 0.090090 0.073959 0.099370 0.082357 0.084272 0.072122 0.084398 0.075741 0.084615 0.084380 0.087382 0.084470 0.113375 0.099071 0.122260 0.114138 0.124065 0.124305 0.132546 0.121120 0.125040 0.122025 0.121954
qa: -0.2707 -0.4054 -0.2996 0.0977 0.0145 -0.0758 -0.2666 -0.2518 -0.1803 0.3622 -0.0434 -0.2076 -0.2379 0.0655 0.0198 -0.1683 -0.2150 0.2519 -0.0744 -0.2177 0.2834 -0.1757 -0.2337 -0.1156 -0.0824 -0.1545 0.0888 0.0722 0.0971 0.0901 0.0740 0.0994 0.0824 0.0843 0.0721 0.0844 0.0757 0.0846 0.0844 0.0874 0.0845 0.1134 0.0991 0.1223 0.1141 0.1241 0.1243 0.1325 0.1211 0.1250 0.1220 0.1220
va: 2.1274 2.0925 2.1150 3.7457 3.8281 3.8257 3.9197 3.9070 3.9187 4.2002 3.8192 3.9361 3.9454 3.8566 3.6619 3.9326 4.0176 3.8376 3.9128 4.0586 3.7879 3.9241 4.0397 3.9541 3.9283 3.9664 1.0266 1.0373 1.0017 1.0046 1.0097 1.0243 1.0036 0.9999 1.0207 0.9976 1.0122 0.9983 1.0162 0.9984 0.9999 0.9896 1.0107 1.0152 1.0162 0.9990 1.0129 1.0126 1.0160 1.0001 0.9990 1.0009
dispcorr: -0.023925452 hartree
energy: -1117.871322153320
dipole: -29.74364 29.19756 -0.54608 -8.03635 7.42556 -0.61078 -4.90776 4.61884 -0.28892
magnitude: 0.86876 au
magnitude: 2.20820 debye
