program: Orca
programVersion: 5.0.2
elementType: O O O C C C C C C C C C C C C C C C C C C C C C C C H H H H H H H H H H H H H H H H H H H H H H H H H H
charge: 0
multiplicity: 1
keywords: wb97x-d3
keywords: def2-TZVPP
keywords: def2/J RIJCOSX
keywords: DEFGRID2
keywords: scfconv7
keywords: smallprint printgap noloewdin
keywords: NOSOSCF
formula: C23H26O3
InChI: InChI=1/C23H26O3/c1-16(2)13-20-21(23(20,3)4)22(24)25-15-17-9-8-12-19(14-17)26-18-10-6-5-7-11-18/h5-14,20-21H,15H2,1-4H3
52 atoms
O  0.002927 -2.424078 0.8056
O  -0.370346 -1.957523 -1.348378
O  3.112148 1.586621 1.333521
C  -2.400726 0.01698 0.168264
C  -3.083815 -0.988717 -0.699122
C  -2.044322 -1.456927 0.287632
C  -3.153297 0.597653 1.341489
C  -1.427249 0.985734 -0.457844
C  -4.518253 -1.330677 -0.516824
C  -0.743956 -1.958464 -0.206188
C  -5.047358 -2.547748 -0.647729
C  -6.51804 -2.779312 -0.474973
C  -4.240986 -3.765494 -0.982497
C  1.316272 -2.857987 0.473707
C  2.221956 -1.717846 0.098041
C  2.244365 -0.561512 0.871673
C  3.049587 -1.81018 -1.010985
C  3.091452 0.478352 0.53274
C  3.906474 -0.768119 -1.334713
C  3.932817 0.384126 -0.568278
C  2.685074 2.778982 0.833638
C  1.914237 2.896419 -0.316997
C  3.034755 3.911598 1.560595
C  1.501436 4.155091 -0.732005
C  2.611522 5.15833 1.134107
C  1.845087 5.290248 -0.015911
H  -2.735641 -1.00034 -1.729511
H  -2.400609 -1.939559 1.191222
H  -2.459125 0.936499 2.112065
H  -3.832017 -0.122599 1.798691
H  -3.746376 1.460575 1.030956
H  -0.685065 1.322913 0.268489
H  -1.961889 1.869677 -0.81103
H  -0.897398 0.559448 -1.307734
H  -5.186103 -0.503395 -0.29275
H  -6.963791 -3.172029 -1.392284
H  -7.048625 -1.865485 -0.210011
H  -6.711601 -3.519188 0.305767
H  -4.304762 -4.506515 -0.181332
H  -3.190255 -3.545793 -1.157028
H  -4.632594 -4.248551 -1.881048
H  1.290319 -3.601391 -0.326478
H  1.678376 -3.350551 1.377291
H  1.60236 -0.458785 1.738087
H  3.018266 -2.695148 -1.633556
H  4.550457 -0.849337 -2.200187
H  4.593784 1.203391 -0.820349
H  1.630462 2.022832 -0.88877
H  3.634481 3.804477 2.454949
H  0.900885 4.240138 -1.628222
H  2.888185 6.035035 1.70491
H  1.520468 6.266754 -0.348314
totalener: -1117.84612465 hartree
nucrepener: 2267.66317356 hartree
electener: -3385.50929821 hartree
oneelecener: -6024.09022680 hartree
twoeener: 2638.58092860 hartree
kineticenergy: 1112.86074888 hartree
xcener: -110.232891172811 hartree
chargesum: -0.0000000
charge: -0.268560 -0.368255 -0.300483 0.148941 -0.009115 -0.128501 -0.276595 -0.281549 -0.244742 0.323618 -0.007132 -0.211018 -0.224021 0.064948 0.055726 -0.273765 -0.130242 0.231224 -0.106926 -0.153907 0.293957 -0.213497 -0.214631 -0.131911 -0.091478 -0.148197 0.105963 0.088466 0.093482 0.085744 0.090463 0.089266 0.090389 0.099893 0.092780 0.087185 0.078638 0.083327 0.086150 0.082108 0.089457 0.099727 0.108980 0.120035 0.104544 0.126226 0.132917 0.137102 0.122520 0.124978 0.123279 0.122488
qa: -0.2686 -0.3683 -0.3005 0.1489 -0.0091 -0.1285 -0.2766 -0.2815 -0.2447 0.3236 -0.0071 -0.2110 -0.2240 0.0649 0.0557 -0.2738 -0.1302 0.2312 -0.1069 -0.1539 0.2940 -0.2135 -0.2146 -0.1319 -0.0915 -0.1482 0.1060 0.0885 0.0935 0.0857 0.0905 0.0893 0.0904 0.0999 0.0928 0.0872 0.0786 0.0833 0.0862 0.0821 0.0895 0.0997 0.1090 0.1200 0.1045 0.1262 0.1329 0.1371 0.1225 0.1250 0.1233 0.1225
va: 2.1167 2.1316 2.1021 3.7487 3.8185 3.8254 3.9049 3.8994 3.9039 4.2263 3.7374 3.9418 3.9373 3.8605 3.6476 4.0335 4.0043 3.8299 3.9464 3.9945 3.7611 3.9010 4.0292 3.9778 3.9436 3.9665 1.0270 1.0298 1.0068 1.0046 1.0016 1.0001 1.0062 1.0141 1.0093 0.9985 1.0097 0.9993 1.0006 1.0201 1.0023 1.0096 0.9891 1.0284 1.0137 1.0004 1.0025 1.0026 1.0154 1.0011 0.9987 1.0007
dispcorr: -0.026238564 hartree
energy: -1117.872363212969
dipole: -28.72712 28.42109 -0.30603 -5.27549 5.11194 -0.16355 -2.76868 2.92861 0.15993
magnitude: 0.38207 au
magnitude: 0.97116 debye
