program: Orca
programVersion: 5.0.2
elementType: O O O C C C C C C C C C C C C C C C C C C C C C C C H H H H H H H H H H H H H H H H H H H H H H H H H H
charge: 0
multiplicity: 1
keywords: wb97x-d3
keywords: def2-TZVPP
keywords: def2/J RIJCOSX
keywords: DEFGRID2
keywords: scfconv7
keywords: smallprint printgap noloewdin
keywords: NOSOSCF
formula: C23H26O3
InChI: InChI=1/C23H26O3/c1-16(2)13-20-21(23(20,3)4)22(24)25-15-17-9-8-12-19(14-17)26-18-10-6-5-7-11-18/h5-14,20-21H,15H2,1-4H3
52 atoms
O  -0.205235 -1.803824 -1.690207
O  -0.818145 0.076937 -0.642892
O  3.846174 1.724601 0.605323
C  -2.16422 -2.169597 1.179665
C  -3.182792 -1.322657 0.489608
C  -2.069353 -1.938151 -0.320767
C  -2.532747 -3.572563 1.597313
C  -1.177681 -1.508885 2.111679
C  -4.58608 -1.775731 0.30589
C  -0.995593 -1.089506 -0.877481
C  -5.353596 -1.491592 -0.746933
C  -6.769681 -1.974604 -0.832991
C  -4.881774 -0.673687 -1.910584
C  0.980321 -1.162553 -2.154035
C  1.962073 -0.957402 -1.033915
C  2.449122 0.310638 -0.760367
C  2.361799 -2.036041 -0.250897
C  3.31751 0.506144 0.306366
C  3.236999 -1.834379 0.803095
C  3.71216 -0.564714 1.094002
C  3.09681 2.861487 0.520232
C  3.783612 4.029173 0.214694
C  1.730532 2.894764 0.774494
C  3.101914 5.234029 0.165819
C  1.061159 4.107968 0.71189
C  1.737128 5.280435 0.410067
H  -3.059326 -0.254614 0.653711
H  -2.326066 -2.797439 -0.930534
H  -3.223315 -4.048075 0.900901
H  -3.003489 -3.571822 2.582792
H  -1.641535 -4.199244 1.659489
H  -0.225977 -2.043608 2.123453
H  -1.572481 -1.513883 3.129213
H  -0.973668 -0.474795 1.843546
H  -5.018408 -2.358586 1.114528
H  -7.051021 -2.576688 0.030243
H  -6.923701 -2.579607 -1.730144
H  -7.467913 -1.136635 -0.900363
H  -5.528642 0.195312 -2.054978
H  -4.929747 -1.250907 -2.8376
H  -3.862996 -0.311284 -1.791954
H  0.746142 -0.214398 -2.642999
H  1.381679 -1.840843 -2.907676
H  2.125997 1.150075 -1.363172
H  1.983414 -3.028926 -0.4588
H  3.548357 -2.671155 1.414295
H  4.386037 -0.397936 1.923844
H  4.847474 3.984409 0.021884
H  1.183543 1.990357 1.0077
H  3.642795 6.140805 -0.071117
H  -0.003399 4.129219 0.903785
H  1.205569 6.221276 0.366327
totalener: -1117.84641687 hartree
nucrepener: 2255.72053647 hartree
electener: -3373.56695334 hartree
oneelecener: -6000.32453195 hartree
twoeener: 2626.75757861 hartree
kineticenergy: 1112.85793587 hartree
xcener: -110.232687102885 hartree
chargesum: -0.0000000
charge: -0.263831 -0.383427 -0.299153 0.130997 -0.016037 -0.104997 -0.278941 -0.244462 -0.241138 0.324227 -0.006291 -0.211890 -0.225223 0.061972 0.053626 -0.179316 -0.254935 0.261733 -0.064667 -0.220551 0.272015 -0.226914 -0.172457 -0.086914 -0.120828 -0.149169 0.105035 0.084470 0.084993 0.090718 0.091330 0.084164 0.087796 0.086960 0.093391 0.078392 0.084127 0.087204 0.089742 0.085438 0.081722 0.100188 0.111698 0.119304 0.115690 0.124891 0.124304 0.121986 0.139803 0.123476 0.127153 0.122592
qa: -0.2638 -0.3834 -0.2992 0.1310 -0.0160 -0.1050 -0.2789 -0.2445 -0.2411 0.3242 -0.0063 -0.2119 -0.2252 0.0620 0.0536 -0.1793 -0.2549 0.2617 -0.0647 -0.2206 0.2720 -0.2269 -0.1725 -0.0869 -0.1208 -0.1492 0.1050 0.0845 0.0850 0.0907 0.0913 0.0842 0.0878 0.0870 0.0934 0.0784 0.0841 0.0872 0.0897 0.0854 0.0817 0.1002 0.1117 0.1193 0.1157 0.1249 0.1243 0.1220 0.1398 0.1235 0.1272 0.1226
va: 2.1193 2.1142 2.1149 3.7565 3.8272 3.7958 3.9069 3.8982 3.9009 4.2370 3.7324 3.9421 3.9395 3.8596 3.6358 3.9481 4.0002 3.8337 3.8921 4.0560 3.7898 4.0390 3.9341 3.9313 3.9587 3.9614 1.0251 1.0320 1.0048 1.0012 1.0061 1.0052 1.0047 1.0192 1.0091 1.0098 0.9990 0.9986 1.0018 1.0009 1.0210 1.0111 0.9899 1.0149 1.0186 0.9985 1.0132 1.0159 0.9995 0.9988 0.9999 1.0008
dispcorr: -0.025525144 hartree
energy: -1117.871942015306
dipole: -29.68185 29.18809 -0.49376 -12.64370 12.00162 -0.64209 2.12101 -2.31063 -0.18962
magnitude: 0.83188 au
magnitude: 2.11448 debye
