program: Orca
programVersion: 5.0.2
elementType: O O O C C C C C C C C C C C C C C C C C C C C C C C H H H H H H H H H H H H H H H H H H H H H H H H H H
charge: 0
multiplicity: 1
keywords: wb97x-d3
keywords: def2-TZVPP
keywords: def2/J RIJCOSX
keywords: DEFGRID2
keywords: scfconv7
keywords: smallprint printgap noloewdin
keywords: NOSOSCF
formula: C23H26O3
InChI: InChI=1/C23H26O3/c1-16(2)13-20-21(23(20,3)4)22(24)25-15-17-9-8-12-19(14-17)26-18-10-6-5-7-11-18/h5-14,20-21H,15H2,1-4H3
52 atoms
O  0.27687 -2.628575 0.737932
O  -0.300765 -2.068303 -1.348463
O  3.196129 1.488629 1.345194
C  -2.31729 -0.25624 0.292296
C  -3.026486 -1.381034 -0.404126
C  -1.823249 -1.683064 0.458547
C  -2.939166 0.376817 1.51369
C  -1.540305 0.730366 -0.545301
C  -4.361382 -1.856955 0.003592
C  -0.567661 -2.133073 -0.178701
C  -5.397849 -2.117834 -0.79663
C  -6.701166 -2.600147 -0.231761
C  -5.390049 -1.965194 -2.287367
C  1.576103 -2.978456 0.278695
C  2.40231 -1.770012 -0.066154
C  2.411555 -0.668042 0.783087
C  3.169559 -1.745163 -1.221294
C  3.186704 0.435035 0.472943
C  3.955701 -0.64045 -1.516375
C  3.969672 0.457531 -0.67398
C  2.682508 2.685812 0.948397
C  1.844586 2.834565 -0.150586
C  3.014434 3.787508 1.729104
C  1.347307 4.093167 -0.460072
C  2.506899 5.034396 1.407893
C  1.672966 5.197641 0.310069
H  -2.811779 -1.437659 -1.465455
H  -2.012087 -2.119593 1.433455
H  -2.176769 0.878922 2.111432
H  -3.440215 -0.342529 2.15989
H  -3.67811 1.124653 1.220793
H  -2.197954 1.544964 -0.854627
H  -1.118331 0.285074 -1.443366
H  -0.723305 1.170845 0.030395
H  -4.507248 -2.010975 1.068906
H  -6.674007 -2.683857 0.854052
H  -6.96514 -3.580432 -0.636853
H  -7.518781 -1.92459 -0.495724
H  -5.669229 -2.903995 -2.771759
H  -4.428942 -1.658603 -2.692941
H  -6.130067 -1.224061 -2.600267
H  1.520203 -3.658162 -0.574601
H  2.024793 -3.521585 1.111734
H  1.814902 -0.656119 1.686958
H  3.14558 -2.587266 -1.901078
H  4.553811 -0.629883 -2.417758
H  4.575492 1.324912 -0.902352
H  1.575579 1.985351 -0.764649
H  3.666929 3.657359 2.582447
H  0.69448 4.202212 -1.316223
H  2.770745 5.886626 2.020221
H  1.282093 6.1743 0.060082
totalener: -1117.84766991 hartree
nucrepener: 2250.25956785 hartree
electener: -3368.10723776 hartree
oneelecener: -5989.21760511 hartree
twoeener: 2621.11036735 hartree
kineticenergy: 1112.85913878 hartree
xcener: -110.233740845195 hartree
chargesum: -0.0000000
charge: -0.271930 -0.374006 -0.300949 0.096083 0.042429 -0.082711 -0.249071 -0.264844 -0.185903 0.320188 -0.053593 -0.203405 -0.236167 0.066192 0.049264 -0.257300 -0.134530 0.222400 -0.105420 -0.155042 0.292712 -0.213900 -0.213737 -0.132293 -0.090941 -0.148804 0.088508 0.072569 0.094650 0.071512 0.092081 0.089734 0.101354 0.079628 0.070507 0.076029 0.084854 0.082893 0.085046 0.083613 0.085698 0.101120 0.108002 0.119347 0.105548 0.126307 0.132604 0.139451 0.122655 0.125009 0.123343 0.123216
qa: -0.2719 -0.3740 -0.3009 0.0961 0.0424 -0.0827 -0.2491 -0.2648 -0.1859 0.3202 -0.0536 -0.2034 -0.2362 0.0662 0.0493 -0.2573 -0.1345 0.2224 -0.1054 -0.1550 0.2927 -0.2139 -0.2137 -0.1323 -0.0909 -0.1488 0.0885 0.0726 0.0947 0.0715 0.0921 0.0897 0.1014 0.0796 0.0705 0.0760 0.0849 0.0829 0.0850 0.0836 0.0857 0.1011 0.1080 0.1193 0.1055 0.1263 0.1326 0.1395 0.1227 0.1250 0.1233 0.1232
va: 2.1169 2.1301 2.1037 3.7412 3.8006 3.8515 3.9137 3.9138 3.9010 4.2699 3.8279 3.9346 3.9449 3.8621 3.6598 4.0363 4.0055 3.8347 3.9446 3.9942 3.7674 3.8969 4.0264 3.9784 3.9436 3.9649 1.0370 1.0370 1.0040 1.0099 1.0040 1.0044 1.0185 1.0013 1.0214 1.0123 0.9983 0.9982 0.9993 1.0165 0.9989 1.0101 0.9891 1.0294 1.0133 1.0003 1.0027 1.0012 1.0153 1.0013 0.9987 1.0006
dispcorr: -0.025018550 hartree
energy: -1117.872688462232
dipole: -31.36376 31.04981 -0.31395 -2.02889 2.02894 0.00005 -4.43211 4.50721 0.07510
magnitude: 0.32281 au
magnitude: 0.82052 debye
