program: Orca
programVersion: 5.0.2
elementType: O O O C C C C C C C C C C C C C C C C C C C C C C C H H H H H H H H H H H H H H H H H H H H H H H H H H
charge: 0
multiplicity: 1
keywords: wb97x-d3
keywords: def2-TZVPP
keywords: def2/J RIJCOSX
keywords: DEFGRID2
keywords: scfconv7
keywords: smallprint printgap noloewdin
keywords: NOSOSCF
formula: C23H26O3
InChI: InChI=1/C23H26O3/c1-16(2)13-20-21(23(20,3)4)22(24)25-15-17-9-8-12-19(14-17)26-18-10-6-5-7-11-18/h5-14,20-21H,15H2,1-4H3
52 atoms
O  0.120838 -2.06887 -1.691914
O  -0.594558 -0.109388 -0.884096
O  3.854107 1.772202 0.619558
C  -2.22119 -2.121815 0.941802
C  -3.120941 -1.394466 -0.015634
C  -1.890011 -2.091278 -0.539589
C  -2.657582 -3.454885 1.499932
C  -1.402867 -1.314052 1.919623
C  -4.456878 -1.900735 -0.388316
C  -0.751255 -1.291603 -1.03885
C  -5.612501 -1.238787 -0.301824
C  -6.899157 -1.878543 -0.731853
C  -5.753757 0.159854 0.217155
C  1.34077 -1.455525 -2.102607
C  2.213257 -1.117452 -0.925747
C  2.628422 0.189187 -0.723682
C  2.588492 -2.108857 -0.024403
C  3.400947 0.509694 0.385361
C  3.371271 -1.783657 1.070746
C  3.775029 -0.474929 1.28708
C  3.060054 2.859841 0.401709
C  3.712355 4.043772 0.082575
C  1.676686 2.834075 0.53598
C  2.978406 5.204015 -0.100743
C  0.955851 4.002202 0.337969
C  1.596606 5.190168 0.021084
H  -3.019848 -0.315261 0.021054
H  -2.03925 -3.031401 -1.060367
H  -1.793724 -4.025636 1.845106
H  -3.186762 -4.068604 0.772392
H  -3.323994 -3.310287 2.352078
H  -1.959316 -1.193181 2.850837
H  -1.157391 -0.321378 1.549791
H  -0.465708 -1.821546 2.157977
H  -4.491984 -2.914654 -0.776744
H  -7.613445 -1.919588 0.094337
H  -6.751529 -2.89401 -1.097453
H  -7.377407 -1.302521 -1.528053
H  -4.81217 0.608811 0.524327
H  -6.42233 0.179871 1.081487
H  -6.20331 0.810325 -0.536927
H  1.144476 -0.567203 -2.706946
H  1.818908 -2.198795 -2.741259
H  2.323302 0.961095 -1.418943
H  2.265845 -3.13149 -0.174125
H  3.664968 -2.553266 1.772254
H  4.376842 -0.211821 2.146796
H  4.789977 4.047215 -0.015668
H  1.155521 1.917166 0.778514
H  3.492935 6.12333 -0.347825
H  -0.121267 3.975519 0.435865
H  1.025138 6.095855 -0.129802
totalener: -1117.84754019 hartree
nucrepener: 2240.67247665 hartree
electener: -3358.52001684 hartree
oneelecener: -5970.18375354 hartree
twoeener: 2611.66373670 hartree
kineticenergy: 1112.86363958 hartree
xcener: -110.234552224750 hartree
chargesum: -0.0000000
charge: -0.265198 -0.388237 -0.299354 0.091903 0.041518 -0.090163 -0.243837 -0.245312 -0.192229 0.332040 -0.046935 -0.205302 -0.236121 0.060079 0.040975 -0.176195 -0.241652 0.261727 -0.067646 -0.220483 0.276326 -0.227987 -0.173387 -0.086538 -0.121479 -0.149440 0.088854 0.070843 0.090902 0.070865 0.092236 0.087605 0.085720 0.085211 0.072584 0.083604 0.076444 0.084974 0.082327 0.084651 0.086988 0.100290 0.113071 0.120515 0.114879 0.124094 0.124410 0.121969 0.138175 0.123186 0.126103 0.122427
qa: -0.2652 -0.3882 -0.2994 0.0919 0.0415 -0.0902 -0.2438 -0.2453 -0.1922 0.3320 -0.0469 -0.2053 -0.2361 0.0601 0.0410 -0.1762 -0.2417 0.2617 -0.0676 -0.2205 0.2763 -0.2280 -0.1734 -0.0865 -0.1215 -0.1494 0.0889 0.0708 0.0909 0.0709 0.0922 0.0876 0.0857 0.0852 0.0726 0.0836 0.0764 0.0850 0.0823 0.0847 0.0870 0.1003 0.1131 0.1205 0.1149 0.1241 0.1244 0.1220 0.1382 0.1232 0.1261 0.1224
va: 2.1250 2.1143 2.1159 3.7531 3.7854 3.8574 3.9091 3.9142 3.8993 4.2650 3.8184 3.9361 3.9467 3.8609 3.6452 3.9424 4.0041 3.8304 3.8997 4.0565 3.7902 4.0374 3.9319 3.9314 3.9594 3.9623 1.0358 1.0386 1.0043 1.0105 1.0046 1.0030 1.0211 1.0046 1.0203 0.9983 1.0120 0.9982 1.0149 0.9995 0.9992 1.0110 0.9896 1.0150 1.0177 0.9987 1.0132 1.0158 1.0000 0.9988 1.0001 1.0008
dispcorr: -0.024569261 hartree
energy: -1117.872109453506
dipole: -32.59141 32.05448 -0.53693 -10.29737 9.68055 -0.61682 5.71566 -5.70446 0.01120
magnitude: 0.81785 au
magnitude: 2.07882 debye
