program: Orca
programVersion: 5.0.2
elementType: O O O C C C C C C C C C C C C C C C C C C C C C C C H H H H H H H H H H H H H H H H H H H H H H H H H H
charge: 0
multiplicity: 1
keywords: wb97x-d3
keywords: def2-TZVPP
keywords: def2/J RIJCOSX
keywords: DEFGRID2
keywords: scfconv7
keywords: smallprint printgap noloewdin
keywords: NOSOSCF
formula: C23H26O3
InChI: InChI=1/C23H26O3/c1-16(2)13-20-21(23(20,3)4)22(24)25-15-17-9-8-12-19(14-17)26-18-10-6-5-7-11-18/h5-14,20-21H,15H2,1-4H3
52 atoms
O  0.250087 -1.39453 1.700266
O  -0.282692 -2.489944 -0.176394
O  3.721946 1.886278 -0.136648
C  -2.303576 -0.131466 -0.551679
C  -3.03373 -1.292224 0.053687
C  -1.74627 -0.802621 0.688842
C  -2.829639 1.2718 -0.361572
C  -1.644172 -0.328401 -1.895158
C  -4.300045 -1.146143 0.794062
C  -0.543707 -1.658877 0.651513
C  -5.384846 -1.917854 0.693654
C  -6.601793 -1.639417 1.524919
C  -5.514956 -3.098508 -0.220415
C  1.504367 -2.060968 1.740938
C  2.509862 -1.431672 0.816391
C  2.615704 -0.048416 0.744558
C  3.370021 -2.223765 0.067016
C  3.575434 0.529104 -0.073644
C  4.34109 -1.637327 -0.729645
C  4.445817 -0.257907 -0.811835
C  2.63747 2.658883 -0.428603
C  2.594396 3.927119 0.135414
C  1.630288 2.239018 -1.289593
C  1.540964 4.77577 -0.165031
C  0.582144 3.09936 -1.578941
C  0.527406 4.367083 -1.019442
H  -2.912248 -2.217038 -0.499091
H  -1.85451 -0.230304 1.603503
H  -2.0239 1.996761 -0.490824
H  -3.258991 1.438636 0.625253
H  -3.604239 1.492766 -1.098035
H  -0.771217 0.319862 -1.995958
H  -2.346756 -0.062278 -2.687168
H  -1.318553 -1.350776 -2.065888
H  -4.342861 -0.321574 1.499556
H  -6.472792 -0.76681 2.164056
H  -6.842687 -2.491283 2.165963
H  -7.478234 -1.467063 0.89517
H  -6.327546 -2.942722 -0.93379
H  -5.76804 -3.997233 0.346206
H  -4.615231 -3.311636 -0.791865
H  1.393066 -3.124199 1.518748
H  1.835244 -1.967372 2.776516
H  1.952251 0.583806 1.322333
H  3.276473 -3.301694 0.101765
H  5.009871 -2.258706 -1.310179
H  5.191145 0.210566 -1.440759
H  3.386763 4.240142 0.802519
H  1.663715 1.254428 -1.738288
H  1.511691 5.7622 0.278743
H  -0.195279 2.773283 -2.257927
H  -0.293878 5.031414 -1.251269
totalener: -1117.84780514 hartree
nucrepener: 2272.65928552 hartree
electener: -3390.50709066 hartree
oneelecener: -6033.91254547 hartree
twoeener: 2643.40545481 hartree
kineticenergy: 1112.86279742 hartree
xcener: -110.234940161373 hartree
chargesum: -0.0000000
charge: -0.276593 -0.382164 -0.302455 0.108727 0.034651 -0.079256 -0.246860 -0.252769 -0.184152 0.331515 -0.056165 -0.202535 -0.235649 0.069601 0.047737 -0.194666 -0.159215 0.203085 -0.092650 -0.197598 0.224523 -0.204700 -0.119282 -0.091862 -0.171284 -0.141402 0.088949 0.070419 0.086358 0.071048 0.091755 0.055926 0.089538 0.105783 0.070235 0.075916 0.084658 0.083258 0.086124 0.085179 0.083093 0.100887 0.106964 0.126264 0.107210 0.124466 0.126815 0.124940 0.135693 0.124045 0.140854 0.125041
qa: -0.2766 -0.3822 -0.3025 0.1087 0.0347 -0.0793 -0.2469 -0.2528 -0.1842 0.3315 -0.0562 -0.2025 -0.2356 0.0696 0.0477 -0.1947 -0.1592 0.2031 -0.0926 -0.1976 0.2245 -0.2047 -0.1193 -0.0919 -0.1713 -0.1414 0.0889 0.0704 0.0864 0.0710 0.0918 0.0559 0.0895 0.1058 0.0702 0.0759 0.0847 0.0833 0.0861 0.0852 0.0831 0.1009 0.1070 0.1263 0.1072 0.1245 0.1268 0.1249 0.1357 0.1240 0.1409 0.1250
va: 2.1181 2.1204 2.1006 3.6929 3.8232 3.8621 3.9163 3.9080 3.9061 4.2382 3.8276 3.9342 3.9449 3.8644 3.6788 3.9553 4.0138 3.8413 3.9386 4.0442 3.8546 4.0264 3.8700 3.9490 3.9367 3.9619 1.0336 1.0389 1.0118 1.0140 1.0029 1.0168 1.0007 1.0269 1.0225 1.0124 0.9983 0.9981 0.9990 0.9994 1.0163 1.0144 0.9881 1.0224 1.0125 0.9998 1.0110 1.0137 1.0037 0.9983 0.9890 1.0013
dispcorr: -0.025649576 hartree
energy: -1117.873454713987
dipole: -32.91852 32.40804 -0.51048 -4.55920 4.72090 0.16169 -2.64547 2.89703 0.25156
magnitude: 0.59162 au
magnitude: 1.50378 debye
