program: Orca
programVersion: 5.0.2
elementType: O O O C C C C C C C C C C C C C C C C C C C C C C C H H H H H H H H H H H H H H H H H H H H H H H H H H
charge: 0
multiplicity: 1
keywords: wb97x-d3
keywords: def2-TZVPP
keywords: def2/J RIJCOSX
keywords: DEFGRID2
keywords: scfconv7
keywords: smallprint printgap noloewdin
keywords: NOSOSCF
formula: C23H26O3
InChI: InChI=1/C23H26O3/c1-16(2)13-20-21(23(20,3)4)22(24)25-15-17-9-8-12-19(14-17)26-18-10-6-5-7-11-18/h5-14,20-21H,15H2,1-4H3
52 atoms
O  0.444532 -1.964687 -1.462901
O  0.011257 -3.223573 0.336045
O  2.023287 2.200529 1.000311
C  -2.995486 -2.77996 -0.49083
C  -2.603831 -1.794517 0.553408
C  -1.739278 -1.952225 -0.690892
C  -4.132967 -2.448044 -1.427661
C  -2.902776 -4.251313 -0.168541
C  -3.319372 -0.51914 0.797776
C  -0.370395 -2.47503 -0.523504
C  -2.790366 0.526686 1.435856
C  -3.572048 1.785226 1.658452
C  -1.388711 0.54668 1.963009
C  1.836938 -2.166166 -1.280101
C  2.410714 -1.231971 -0.247035
C  1.916575 0.062477 -0.123912
C  3.464851 -1.645441 0.556223
C  2.489658 0.93623 0.790497
C  4.029088 -0.764904 1.466841
C  3.551707 0.528683 1.586626
C  1.463827 2.924382 -0.010205
C  1.994559 2.95153 -1.294498
C  0.358339 3.70154 0.307687
C  1.397492 3.74701 -2.259898
C  -0.222472 4.50014 -0.665187
C  0.288323 4.522446 -1.954071
H  -2.154386 -2.246308 1.433563
H  -1.825859 -1.160213 -1.425683
H  -4.041266 -3.015804 -2.354834
H  -4.164953 -1.391418 -1.692973
H  -5.092612 -2.706731 -0.975421
H  -2.106691 -4.478847 0.535682
H  -2.730281 -4.83908 -1.072192
H  -3.844326 -4.589025 0.268936
H  -4.342589 -0.444512 0.441764
H  -3.068928 2.639994 1.198126
H  -3.66058 2.011747 2.724059
H  -4.577772 1.7243 1.244022
H  -0.850327 -0.386217 1.80923
H  -1.378534 0.765235 3.034059
H  -0.810695 1.338468 1.480669
H  2.279465 -1.961619 -2.256691
H  2.058887 -3.203832 -1.023011
H  1.081637 0.384675 -0.733292
H  3.837493 -2.659206 0.481391
H  4.847659 -1.090376 2.094994
H  3.984575 1.220387 2.29695
H  2.866219 2.359521 -1.541413
H  -0.033064 3.68295 1.316657
H  1.811267 3.76353 -3.259535
H  -1.082831 5.105187 -0.410997
H  -0.169962 5.142236 -2.712648
totalener: -1117.84623276 hartree
nucrepener: 2323.95877804 hartree
electener: -3441.80501080 hartree
oneelecener: -6136.59537706 hartree
twoeener: 2694.79036626 hartree
kineticenergy: 1112.84945379 hartree
xcener: -110.233357534554 hartree
chargesum: -0.0000000
charge: -0.278901 -0.379569 -0.302053 0.147104 -0.034601 -0.067909 -0.279762 -0.254058 -0.236328 0.298517 0.031975 -0.215030 -0.229630 0.071013 0.079048 -0.283921 -0.193053 0.308791 -0.070645 -0.245778 0.274048 -0.188668 -0.232035 -0.106514 -0.082454 -0.150919 0.101829 0.081220 0.091274 0.078312 0.094796 0.101309 0.083724 0.082723 0.093210 0.077336 0.086964 0.078578 0.084925 0.093706 0.051384 0.103298 0.101499 0.137174 0.106153 0.123898 0.123818 0.131631 0.136225 0.126663 0.124357 0.125325
qa: -0.2789 -0.3796 -0.3021 0.1471 -0.0346 -0.0679 -0.2798 -0.2541 -0.2363 0.2985 0.0320 -0.2150 -0.2296 0.0710 0.0790 -0.2839 -0.1931 0.3088 -0.0706 -0.2458 0.2740 -0.1887 -0.2320 -0.1065 -0.0825 -0.1509 0.1018 0.0812 0.0913 0.0783 0.0948 0.1013 0.0837 0.0827 0.0932 0.0773 0.0870 0.0786 0.0849 0.0937 0.0514 0.1033 0.1015 0.1372 0.1062 0.1239 0.1238 0.1316 0.1362 0.1267 0.1244 0.1253
va: 2.1083 2.1147 2.0963 3.7671 3.8451 3.7935 3.9144 3.8912 3.8971 4.2335 3.6983 3.9454 3.9600 3.8674 3.6891 3.9322 4.0469 3.7003 3.9319 4.0827 3.8044 3.9586 4.0037 3.9389 3.9305 3.9810 1.0242 1.0336 1.0065 1.0052 0.9998 1.0221 1.0028 1.0016 1.0109 0.9996 0.9983 1.0110 1.0206 1.0045 1.0120 0.9865 1.0153 1.0175 1.0116 0.9991 1.0146 1.0048 1.0062 0.9995 1.0003 1.0006
dispcorr: -0.027136991 hartree
energy: -1117.873369754599
dipole: -22.13678 21.99404 -0.14274 -4.15292 4.61152 0.45859 0.93834 -1.55790 -0.61955
magnitude: 0.78392 au
magnitude: 1.99257 debye
