program: Orca
programVersion: 5.0.2
elementType: O O O C C C C C C C C C C C C C C C C C C C C C C C H H H H H H H H H H H H H H H H H H H H H H H H H H
charge: 0
multiplicity: 1
keywords: wb97x-d3
keywords: def2-TZVPP
keywords: def2/J RIJCOSX
keywords: DEFGRID2
keywords: scfconv7
keywords: smallprint printgap noloewdin
keywords: NOSOSCF
formula: C23H26O3
InChI: InChI=1/C23H26O3/c1-16(2)13-20-21(23(20,3)4)22(24)25-15-17-9-8-12-19(14-17)26-18-10-6-5-7-11-18/h5-14,20-21H,15H2,1-4H3
52 atoms
O  0.332148 -1.565803 0.207616
O  -0.943703 -2.633105 1.697998
O  3.606447 2.05092 -1.101067
C  -2.996979 -2.610661 -0.671567
C  -3.351908 -1.550118 0.324779
C  -1.947243 -1.60783 -0.218922
C  -3.480851 -2.451878 -2.092553
C  -2.936184 -4.048721 -0.219872
C  -4.227717 -0.401066 -0.018649
C  -0.840734 -2.001293 0.679377
C  -5.552652 -0.386267 0.132178
C  -6.366872 0.821721 -0.219162
C  -6.331313 -1.553726 0.65757
C  1.490806 -1.878267 0.97033
C  2.670171 -1.172082 0.368061
C  2.55712 0.133877 -0.094576
C  3.901977 -1.812769 0.317452
C  3.67536 0.788741 -0.590745
C  5.011717 -1.151372 -0.185855
C  4.908101 0.152723 -0.638101
C  2.866872 3.008846 -0.472432
C  2.192072 3.914896 -1.27847
C  2.823904 3.130289 0.911503
C  1.478722 4.950825 -0.69628
C  2.096719 4.164906 1.479805
C  1.42195 5.07855 0.683603
H  -3.433069 -1.909146 1.347316
H  -1.678535 -0.863081 -0.960708
H  -3.484515 -1.413173 -2.420176
H  -4.501942 -2.825606 -2.190666
H  -2.850075 -3.019479 -2.778928
H  -2.225889 -4.618088 -0.823028
H  -3.91654 -4.512676 -0.34715
H  -2.650677 -4.155355 0.823511
H  -3.743532 0.488546 -0.411227
H  -6.91362 1.195095 0.650308
H  -7.115813 0.582967 -0.978473
H  -5.749988 1.634681 -0.600159
H  -5.707366 -2.419527 0.870951
H  -7.093603 -1.863201 -0.061934
H  -6.862181 -1.287329 1.575001
H  1.656194 -2.958938 0.983263
H  1.351343 -1.565655 2.009535
H  1.599374 0.638352 -0.077457
H  3.995108 -2.833994 0.665832
H  5.967552 -1.656476 -0.226089
H  5.767272 0.67795 -1.03342
H  2.238041 3.806578 -2.354167
H  3.356303 2.430113 1.542271
H  0.958602 5.658144 -1.328815
H  2.065331 4.258826 2.55736
H  0.860804 5.885324 1.135107
totalener: -1117.84753770 hartree
nucrepener: 2173.60339030 hartree
electener: -3291.45092800 hartree
oneelecener: -5835.75315985 hartree
twoeener: 2544.30223185 hartree
kineticenergy: 1112.85225951 hartree
xcener: -110.230675941066 hartree
chargesum: -0.0000000
charge: -0.270466 -0.387617 -0.299908 0.099797 -0.030286 -0.091068 -0.237990 -0.275507 -0.182533 0.330783 -0.031126 -0.212711 -0.233087 0.069439 0.037883 -0.167003 -0.182346 0.214800 -0.093189 -0.204539 0.244053 -0.213407 -0.159186 -0.090811 -0.116462 -0.147129 0.105051 0.077991 0.080228 0.086153 0.093713 0.088447 0.082548 0.106120 0.089382 0.086545 0.083523 0.079188 0.080706 0.084152 0.094081 0.093585 0.104602 0.123648 0.108527 0.124076 0.125517 0.124931 0.130967 0.124690 0.126507 0.124740
qa: -0.2705 -0.3876 -0.2999 0.0998 -0.0303 -0.0911 -0.2380 -0.2755 -0.1825 0.3308 -0.0311 -0.2127 -0.2331 0.0694 0.0379 -0.1670 -0.1823 0.2148 -0.0932 -0.2045 0.2441 -0.2134 -0.1592 -0.0908 -0.1165 -0.1471 0.1051 0.0780 0.0802 0.0862 0.0937 0.0884 0.0825 0.1061 0.0894 0.0865 0.0835 0.0792 0.0807 0.0842 0.0941 0.0936 0.1046 0.1236 0.1085 0.1241 0.1255 0.1249 0.1310 0.1247 0.1265 0.1247
va: 2.1322 2.1170 2.1064 3.7208 3.8056 3.9106 3.9060 3.9047 3.8565 4.2320 3.7386 3.9407 3.9411 3.8404 3.7564 3.9304 4.0070 3.8439 3.9585 4.0408 3.8155 4.0343 3.9370 3.9339 3.9516 3.9631 1.0256 1.0323 1.0077 1.0042 1.0052 1.0030 1.0017 1.0203 1.0136 0.9978 0.9988 1.0107 1.0117 1.0003 1.0015 1.0047 0.9969 1.0257 1.0133 1.0001 1.0124 1.0142 1.0046 0.9987 1.0000 1.0005
dispcorr: -0.022820274 hartree
energy: -1117.870357973975
dipole: -35.58857 35.22496 -0.36362 -9.82179 10.01348 0.19169 -2.26555 2.00821 -0.25734
magnitude: 0.48496 au
magnitude: 1.23267 debye
